program: Orca
programVersion: 5.0.2
elementType: Cl Cl Cl Cl S O O N C C C C C C C C C C H H H H H H H H H
charge: 0
multiplicity: 1
keywords: wb97x-d3
keywords: def2-TZVPP
keywords: def2/J RIJCOSX
keywords: DEFGRID2
keywords: scfconv7
keywords: smallprint printgap noloewdin
keywords: NOSOSCF
formula: C10H9Cl4NO2S
InChI: InChI=1/C10H9Cl4NO2S/c11-9(12)10(13,14)18-15-7(16)5-3-1-2-4-6(5)8(15)17/h1-2,5-6,9H,3-4H2
27 atoms
Cl -0.934428 -1.211447 1.311128
Cl -2.44518 1.237956 1.22479
Cl -3.918377 -1.414704 0.074072
Cl -3.141706 0.584482 -1.876367
S  -0.28701 0.849189 -0.764767
O  1.323556 -1.600824 -1.407071
O  1.432388 1.899465 1.48318
N  1.125172 0.256814 -0.08222
C  3.032666 -1.077477 0.252762
C  3.083092 0.122353 1.212086
C  4.234284 -1.161939 -0.701687
C  4.310595 1.026881 1.004662
C  1.760644 -0.900739 -0.537369
C  1.818039 0.899993 0.94488
C  4.532472 0.190728 -1.274522
C  4.565455 1.239858 -0.456812
C  -1.599076 0.024128 0.255055
C  -2.55919 -0.640933 -0.736383
H  2.939051 -2.01586 0.804721
H  3.048803 -0.203481 2.254029
H  4.04097 -1.902052 -1.477612
H  5.092967 -1.532221 -0.132778
H  5.170844 0.535754 1.470114
H  4.173277 1.967294 1.537771
H  4.709343 0.294084 -2.338323
H  4.771351 2.238423 -0.82345
H  -2.015999 -1.396464 -1.302515
elementType: Cl S O N C H
totalener: -2830.80207307 hartree
nucrepener: 2171.74771914 hartree
electener: -5002.54979221 hartree
oneelecener: -8222.76333501 hartree
twoeener: 3220.21354280 hartree
cpcmener: -0.02427658 hartree
kineticenergy: 2825.08502738 hartree
xcener: -159.721229957868 hartree
chargesum: 0.0000000
charge: -0.041631 -0.046184 -0.065566 -0.069229 0.055653 -0.388413 -0.386830 -0.100570 0.096983 0.056177 -0.104490 -0.094246 0.169507 0.209164 -0.209262 -0.220995 0.093182 -0.027141 0.103444 0.102409 0.096908 0.101982 0.102075 0.098375 0.144216 0.144873 0.179611
qa: -0.0416 -0.0462 -0.0656 -0.0692 0.0557 -0.3884 -0.3868 -0.1006 0.0970 0.0562 -0.1045 -0.0942 0.1695 0.2092 -0.2093 -0.2210 0.0932 -0.0271 0.1034 0.1024 0.0969 0.1020 0.1021 0.0984 0.1442 0.1449 0.1796
va: 1.2750 1.2613 1.2261 1.2264 2.2985 2.1190 2.1254 3.1086 3.8261 3.8710 3.9623 3.9524 4.2166 4.1931 3.8197 3.8350 4.2726 4.2796 1.0243 1.0245 1.0217 1.0036 1.0033 1.0207 0.9966 0.9963 1.0069
dispcorr: -0.015415095 hartree
energy: -2830.817488168023
dipole: 44.10240 -41.89024 2.21216 -0.84540 -0.23830 -1.08370 -0.97912 1.33791 0.35879
magnitude: 2.48934 au
magnitude: 6.32739 debye
