program: Orca
programVersion: 5.0.2
elementType: Cl Cl Cl Cl S O O N C C C C C C C C C C H H H H H H H H H
charge: 0
multiplicity: 1
keywords: wb97x-d3
keywords: def2-TZVPP
keywords: def2/J RIJCOSX
keywords: DEFGRID2
keywords: scfconv7
keywords: smallprint printgap noloewdin
keywords: NOSOSCF
formula: C10H9Cl4NO2S
InChI: InChI=1/C10H9Cl4NO2S/c11-9(12)10(13,14)18-15-7(16)5-3-1-2-4-6(5)8(15)17/h1-2,5-6,9H,3-4H2
27 atoms
Cl -0.807956 1.697686 -0.902327
Cl -0.630649 -1.027193 -1.749143
Cl -3.417059 -1.670429 -0.294254
Cl -3.605461 1.096746 0.52392
S  -0.824056 -0.44587 1.163589
O  1.339117 -2.4283 0.431129
O  0.986724 1.863401 1.871369
N  0.846799 -0.269459 1.036228
C  3.122772 -0.804392 0.765222
C  3.003121 0.650643 1.241216
C  3.790408 -0.956002 -0.61212
C  3.56271 1.678375 0.242306
C  1.706845 -1.321133 0.703803
C  1.526237 0.8844 1.440126
C  3.256364 0.07034 -1.564305
C  3.146735 1.331243 -1.154666
C  -1.320857 0.046155 -0.518012
C  -2.853586 -0.02466 -0.618001
H  3.658404 -1.415138 1.495396
H  3.487078 0.7902 2.210278
H  3.648963 -1.970985 -0.98256
H  4.868976 -0.825525 -0.479216
H  4.653965 1.666052 0.326021
H  3.246038 2.681709 0.526056
H  2.966473 -0.227728 -2.564415
H  2.764477 2.107397 -1.806205
H  -3.165558 0.253537 -1.624875
elementType: Cl S O N C H
totalener: -2830.80173658 hartree
nucrepener: 2226.72450915 hartree
electener: -5057.52624574 hartree
oneelecener: -8333.27397959 hartree
twoeener: 3275.74773385 hartree
cpcmener: -0.02628788 hartree
kineticenergy: 2825.07547489 hartree
xcener: -159.720907163600 hartree
chargesum: -0.0000000
charge: -0.047166 -0.047297 -0.064960 -0.064323 0.053205 -0.381625 -0.380850 -0.065293 0.084516 0.080598 -0.101791 -0.095907 0.173416 0.173746 -0.214993 -0.219233 0.073606 -0.020305 0.099162 0.098595 0.098720 0.100901 0.101367 0.098699 0.140821 0.140711 0.185678
qa: -0.0472 -0.0473 -0.0650 -0.0643 0.0532 -0.3816 -0.3809 -0.0653 0.0845 0.0806 -0.1018 -0.0959 0.1734 0.1737 -0.2150 -0.2192 0.0736 -0.0203 0.0992 0.0986 0.0987 0.1009 0.1014 0.0987 0.1408 0.1407 0.1857
va: 1.2612 1.2607 1.2281 1.2282 2.3097 2.1249 2.1265 3.1064 3.8245 3.8290 3.9531 3.9482 4.2297 4.2304 3.8077 3.8128 4.3525 4.2264 1.0225 1.0224 1.0219 1.0036 1.0033 1.0216 0.9998 1.0001 0.9962
dispcorr: -0.016932983 hartree
energy: -2830.818669567111
dipole: 36.14022 -34.33234 1.80788 2.76039 -2.44070 0.31969 0.54538 -1.09034 -0.54496
magnitude: 1.91510 au
magnitude: 4.86779 debye
