program: Orca
programVersion: 5.0.2
elementType: Cl Cl Cl Cl S O O N C C C C C C C C C C H H H H H H H H H
charge: 0
multiplicity: 1
keywords: wb97x-d3
keywords: def2-TZVPP
keywords: def2/J RIJCOSX
keywords: DEFGRID2
keywords: scfconv7
keywords: smallprint printgap noloewdin
keywords: NOSOSCF
formula: C10H9Cl4NO2S
InChI: InChI=1/C10H9Cl4NO2S/c11-9(12)10(13,14)18-15-7(16)5-3-1-2-4-6(5)8(15)17/h1-2,5-6,9H,3-4H2
27 atoms
Cl -0.561089 1.195213 -1.216697
Cl -1.274327 -1.582897 -1.043087
Cl -3.703073 0.444905 -1.598525
Cl -3.656173 -0.68377 1.072764
S  -0.67821 -0.083071 1.459862
O  1.373801 -2.227441 0.925608
O  1.19383 2.289739 1.381607
N  0.972655 0.020019 1.135529
C  3.21935 -0.637118 0.87687
C  3.1562 0.890583 1.01577
C  3.853757 -1.122483 -0.436464
C  3.725039 1.649837 -0.193585
C  1.787175 -1.103584 0.970679
C  1.69315 1.215363 1.199372
C  3.348564 -0.31366 -1.592628
C  3.283968 1.010012 -1.475562
C  -1.384036 -0.016064 -0.23119
C  -2.846778 0.415353 -0.059954
H  3.7521 -1.08418 1.719901
H  3.668855 1.223262 1.921587
H  3.662369 -2.187275 -0.568667
H  4.939907 -1.018149 -0.345881
H  4.817127 1.62777 -0.118694
H  3.438936 2.700132 -0.141363
H  3.044894 -0.818188 -2.502215
H  2.925771 1.634087 -2.285469
H  -2.878958 1.416406 0.367979
elementType: Cl S O N C H
totalener: -2830.80303816 hartree
nucrepener: 2205.74048517 hartree
electener: -5036.54352333 hartree
oneelecener: -8291.11324714 hartree
twoeener: 3254.56972381 hartree
cpcmener: -0.02557841 hartree
kineticenergy: 2825.06337423 hartree
xcener: -159.718991168591 hartree
chargesum: -0.0000000
charge: -0.045524 -0.046329 -0.061508 -0.066960 0.052631 -0.385832 -0.384382 -0.076216 0.056648 0.090297 -0.096699 -0.093748 0.206230 0.168246 -0.215022 -0.221690 0.079289 -0.026197 0.100899 0.099691 0.097140 0.100165 0.101030 0.098049 0.143610 0.142229 0.183953
qa: -0.0455 -0.0463 -0.0615 -0.0670 0.0526 -0.3858 -0.3844 -0.0762 0.0566 0.0903 -0.0967 -0.0937 0.2062 0.1682 -0.2150 -0.2217 0.0793 -0.0262 0.1009 0.0997 0.0971 0.1002 0.1010 0.0980 0.1436 0.1422 0.1840
va: 1.2656 1.2651 1.2273 1.2307 2.3055 2.1257 2.1209 3.1094 3.8588 3.8171 3.9557 3.9475 4.2079 4.2362 3.8237 3.8160 4.3369 4.2384 1.0237 1.0220 1.0216 1.0041 1.0027 1.0222 0.9971 0.9981 1.0028
dispcorr: -0.016275925 hartree
energy: -2830.819314090001
dipole: 38.32277 -36.31936 2.00341 4.08869 -3.44021 0.64848 1.90676 -1.73022 0.17654
magnitude: 2.11314 au
magnitude: 5.37116 debye
