program: Orca
programVersion: 5.0.2
elementType: Cl Cl Cl Cl S O O N C C C C C C C C C C H H H H H H H H H
charge: 0
multiplicity: 1
keywords: wb97x-d3
keywords: def2-TZVPP
keywords: def2/J RIJCOSX
keywords: DEFGRID2
keywords: scfconv7
keywords: smallprint printgap noloewdin
keywords: NOSOSCF
formula: C10H9Cl4NO2S
InChI: InChI=1/C10H9Cl4NO2S/c11-9(12)10(13,14)18-15-7(16)5-3-1-2-4-6(5)8(15)17/h1-2,5-6,9H,3-4H2
27 atoms
Cl -1.049624 0.163523 1.852635
Cl -3.043751 1.441879 0.177271
Cl -3.484152 -1.688168 0.920393
Cl -2.876977 -1.063402 -1.833991
S  -0.480285 0.922303 -0.966117
O  0.977945 -1.752281 -1.138209
O  1.582104 2.370343 0.682063
N  0.975905 0.389605 -0.315854
C  2.964382 -0.807933 -0.067765
C  2.947005 0.354048 0.933813
C  3.883403 -0.562567 -1.275281
C  4.266709 1.078962 1.197907
C  1.546298 -0.860593 -0.570943
C  1.809811 1.217506 0.45425
C  5.19876 0.014269 -0.86086
C  5.357602 0.74806 0.233689
C  -1.71964 0.270209 0.22703
C  -2.233237 -1.115723 -0.18895
H  3.232175 -1.75072 0.408708
H  2.576635 -0.045082 1.885694
H  3.408257 0.1156 -1.994311
H  4.027302 -1.504225 -1.806215
H  4.609877 0.849119 2.208693
H  4.104807 2.161311 1.199478
H  6.044254 -0.167314 -1.514649
H  6.335782 1.153098 0.46906
H  -1.411492 -1.828536 -0.172885
elementType: Cl S O N C H
totalener: -2830.80226401 hartree
nucrepener: 2158.14033457 hartree
electener: -4988.94259857 hartree
oneelecener: -8195.03653541 hartree
twoeener: 3206.09393684 hartree
cpcmener: -0.02389149 hartree
kineticenergy: 2825.06143232 hartree
xcener: -159.719046923013 hartree
chargesum: 0.0000000
charge: -0.045512 -0.039835 -0.074012 -0.069498 0.063277 -0.394181 -0.375401 -0.117693 0.178072 -0.002309 -0.133066 -0.039819 0.183278 0.208294 -0.208455 -0.233449 0.104706 -0.050250 0.101441 0.117156 0.097143 0.101872 0.092483 0.081611 0.136544 0.133829 0.183775
qa: -0.0455 -0.0398 -0.0740 -0.0695 0.0633 -0.3942 -0.3754 -0.1177 0.1781 -0.0023 -0.1331 -0.0398 0.1833 0.2083 -0.2085 -0.2334 0.1047 -0.0502 0.1014 0.1172 0.0971 0.1019 0.0925 0.0816 0.1365 0.1338 0.1838
va: 1.2726 1.2749 1.2159 1.2199 2.2919 2.1182 2.1348 3.1360 3.7666 3.8636 3.9614 3.9208 4.2395 4.2274 3.8366 3.9255 4.3071 4.2848 1.0124 1.0226 0.9998 1.0128 1.0019 1.0228 1.0013 0.9988 1.0033
dispcorr: -0.015382228 hartree
energy: -2830.817646237160
dipole: 45.06681 -42.77396 2.29285 0.50472 -1.25696 -0.75224 -0.82486 1.44475 0.61989
magnitude: 2.49144 au
magnitude: 6.33275 debye
