program: Orca
programVersion: 5.0.2
elementType: Cl Cl Cl Cl S O O N C C C C C C C C C C H H H H H H H H H
charge: 0
multiplicity: 1
keywords: wb97x-d3
keywords: def2-TZVPP
keywords: def2/J RIJCOSX
keywords: DEFGRID2
keywords: scfconv7
keywords: smallprint printgap noloewdin
keywords: NOSOSCF
formula: C10H9Cl4NO2S
InChI: InChI=1/C10H9Cl4NO2S/c11-9(12)10(13,14)18-15-7(16)5-3-1-2-4-6(5)8(15)17/h1-2,5-6,9H,3-4H2
27 atoms
Cl -2.866296 -1.458431 -1.060728
Cl -1.175209 -1.574017 1.300877
Cl -2.583633 1.746658 -1.027936
Cl -3.541481 0.546506 1.417677
S  -0.228981 -0.504951 -1.29394
O  1.84943 -2.353895 -0.15639
O  0.859934 2.07915 -0.131754
N  1.075556 -0.196675 -0.270452
C  3.094916 -0.540544 0.8920
C  2.715115 0.945323 0.972994
C  4.440846 -0.796809 0.189357
C  3.798272 1.897642 0.450227
C  1.976528 -1.194908 0.119248
C  1.46288 1.078279 0.142003
C  4.612434 0.109151 -0.99224
C  4.318276 1.400575 -0.864877
C  -1.621677 -0.627044 -0.117882
C  -2.141906 0.740933 0.351577
H  3.116002 -1.000339 1.882315
H  2.445396 1.221601 1.995914
H  4.52076 -1.847855 -0.087151
H  5.236736 -0.612867 0.9177
H  4.603643 1.93724 1.190468
H  3.399909 2.909088 0.37693
H  4.983033 -0.297485 -1.925386
H  4.436871 2.093047 -1.689386
H  -1.366595 1.257187 0.914535
elementType: Cl S O N C H
totalener: -2830.80485061 hartree
nucrepener: 2181.22467781 hartree
electener: -5012.02952842 hartree
oneelecener: -8241.53510771 hartree
twoeener: 3229.50557929 hartree
cpcmener: -0.02533843 hartree
kineticenergy: 2825.06902617 hartree
xcener: -159.719987111090 hartree
chargesum: 0.0000000
charge: -0.039443 -0.045944 -0.067265 -0.075247 0.075729 -0.381608 -0.396286 -0.101566 0.048025 0.095356 -0.082501 -0.120906 0.203968 0.191853 -0.231374 -0.196116 0.104793 -0.052743 0.099303 0.102723 0.098263 0.102459 0.102218 0.096096 0.143550 0.144797 0.181868
qa: -0.0394 -0.0459 -0.0673 -0.0752 0.0757 -0.3816 -0.3963 -0.1016 0.0480 0.0954 -0.0825 -0.1209 0.2040 0.1919 -0.2314 -0.1961 0.1048 -0.0527 0.0993 0.1027 0.0983 0.1025 0.1022 0.0961 0.1435 0.1448 0.1819
va: 1.2759 1.2708 1.2218 1.2135 2.2912 2.1307 2.1161 3.1279 3.8636 3.8391 3.9385 3.9629 4.2063 4.2220 3.8531 3.8033 4.3442 4.2832 1.0245 1.0229 1.0209 1.0028 1.0034 1.0226 0.9968 0.9964 1.0010
dispcorr: -0.015864712 hartree
energy: -2830.820715325595
dipole: 43.18395 -40.92477 2.25918 6.37907 -5.76809 0.61098 2.63137 -1.27986 1.35151
magnitude: 2.70255 au
magnitude: 6.86934 debye
