program: Orca
programVersion: 5.0.2
elementType: Cl Cl Cl Cl S O O N C C C C C C C C C C H H H H H H H H H
charge: 0
multiplicity: 1
keywords: wb97x-d3
keywords: def2-TZVPP
keywords: def2/J RIJCOSX
keywords: DEFGRID2
keywords: scfconv7
keywords: smallprint printgap noloewdin
keywords: NOSOSCF
formula: C10H9Cl4NO2S
InChI: InChI=1/C10H9Cl4NO2S/c11-9(12)10(13,14)18-15-7(16)5-3-1-2-4-6(5)8(15)17/h1-2,5-6,9H,3-4H2
27 atoms
Cl -0.993244 -0.434737 1.847895
Cl -3.128539 1.188061 0.732293
Cl -3.292575 -2.04896 0.35771
Cl -2.863822 -0.450809 -2.014211
S  -0.582676 1.309685 -0.517673
O  0.91409 -1.063986 -1.720115
O  1.521307 2.1121 1.488597
N  0.923063 0.633382 -0.173029
C  2.880017 -0.65447 -0.346437
C  3.029501 0.318937 0.8297
C  3.926884 -0.44251 -1.451404
C  4.298379 1.188926 0.789865
C  1.478804 -0.442142 -0.867088
C  1.772703 1.159802 0.817815
C  5.287338 -0.353245 -0.827463
C  5.458644 0.410434 0.245752
C  -1.727148 0.181778 0.367079
C  -2.151095 -1.011932 -0.504158
H  2.958651 -1.689455 -0.007512
H  3.027993 -0.240363 1.769267
H  3.708505 0.482926 -1.997391
H  3.86018 -1.25002 -2.178623
H  4.502196 1.583833 1.783487
H  4.124718 2.062202 0.151549
H  6.107675 -0.91077 -1.26054
H  6.426574 0.502778 0.721221
H  -1.272572 -1.602748 -0.752401
totalener: -2830.77822850 hartree
nucrepener: 2157.86864697 hartree
electener: -4988.64687547 hartree
oneelecener: -8194.64468014 hartree
twoeener: 3205.99780467 hartree
kineticenergy: 2825.11507605 hartree
xcener: -159.720870806161 hartree
chargesum: -0.0000000
charge: -0.053297 -0.028507 -0.063596 -0.054130 0.092343 -0.326962 -0.279389 -0.117593 0.101843 0.010437 -0.162197 -0.094439 0.138438 0.134114 -0.150201 -0.184653 0.104212 -0.051902 0.096356 0.095448 0.094807 0.102306 0.098964 0.090153 0.122845 0.122110 0.162491
qa: -0.0533 -0.0285 -0.0636 -0.0541 0.0923 -0.3270 -0.2794 -0.1176 0.1018 0.0104 -0.1622 -0.0944 0.1384 0.1341 -0.1502 -0.1847 0.1042 -0.0519 0.0964 0.0954 0.0948 0.1023 0.0990 0.0902 0.1228 0.1221 0.1625
va: 1.2684 1.2870 1.2259 1.2345 2.2944 2.1763 2.2250 3.1238 3.7610 3.8274 3.9754 3.9546 4.2745 4.2713 3.8124 3.8988 4.3236 4.3191 1.0217 1.0251 1.0050 1.0259 1.0196 1.0126 1.0057 1.0050 1.0132
dispcorr: -0.015459306 hartree
energy: -2830.793687808234
dipole: 45.28402 -43.44996 1.83406 1.25051 -1.69281 -0.44230 -2.86301 2.94377 0.08075
magnitude: 1.88837 au
magnitude: 4.79985 debye
