program: Orca
programVersion: 5.0.2
elementType: Cl Cl Cl Cl S O O N C C C C C C C C C C H H H H H H H H H
charge: 0
multiplicity: 1
keywords: wb97x-d3
keywords: def2-TZVPP
keywords: def2/J RIJCOSX
keywords: DEFGRID2
keywords: scfconv7
keywords: smallprint printgap noloewdin
keywords: NOSOSCF
formula: C10H9Cl4NO2S
InChI: InChI=1/C10H9Cl4NO2S/c11-9(12)10(13,14)18-15-7(16)5-3-1-2-4-6(5)8(15)17/h1-2,5-6,9H,3-4H2
27 atoms
Cl -0.30927 -0.658634 -1.469364
Cl -2.698234 -1.813381 -0.293644
Cl -2.939189 1.117163 -1.718944
Cl -3.274001 0.985093 1.150783
S  -0.656686 -0.867886 1.475744
O  1.771055 -2.52237 0.794273
O  0.6915 1.863488 1.296461
N  0.940417 -0.414478 1.194687
C  3.265216 -0.601372 0.842661
C  2.903656 0.877816 1.046659
C  3.966355 -0.897154 -0.491312
C  3.335081 1.794833 -0.105941
C  1.950012 -1.351106 0.921614
C  1.396751 0.900765 1.200156
C  3.3242 -0.129558 -1.60682
C  3.025951 1.152743 -1.424909
C  -1.466589 -0.557847 -0.148928
C  -2.124566 0.829926 -0.178181
H  3.888663 -0.971323 1.660924
H  3.32188 1.258231 1.982825
H  3.956229 -1.971057 -0.675022
H  5.019269 -0.610423 -0.400079
H  4.411385 1.977171 -0.019975
H  2.850104 2.764623 0.000439
H  3.117077 -0.628677 -2.544759
H  2.564119 1.740463 -2.207764
H  -1.355484 1.587915 -0.044888
totalener: -2830.77963104 hartree
nucrepener: 2216.61176039 hartree
electener: -5047.39139143 hartree
oneelecener: -8312.40075855 hartree
twoeener: 3265.00936712 hartree
kineticenergy: 2825.12320827 hartree
xcener: -159.724785775077 hartree
chargesum: -0.0000000
charge: -0.048979 -0.031380 -0.064846 -0.058958 0.082679 -0.282792 -0.336108 -0.111005 0.045450 0.072107 -0.111516 -0.129608 0.136102 0.147956 -0.203928 -0.167849 0.113881 -0.053586 0.089326 0.089111 0.106982 0.093793 0.093318 0.105490 0.130282 0.127100 0.166978
qa: -0.0490 -0.0314 -0.0648 -0.0590 0.0827 -0.2828 -0.3361 -0.1110 0.0455 0.0721 -0.1115 -0.1296 0.1361 0.1480 -0.2039 -0.1678 0.1139 -0.0536 0.0893 0.0891 0.1070 0.0938 0.0933 0.1055 0.1303 0.1271 0.1670
va: 1.2785 1.2833 1.2251 1.2310 2.2936 2.2194 2.1627 3.1416 3.8214 3.7889 3.9548 3.9745 4.2434 4.2329 3.8432 3.8214 4.3040 4.3177 1.0227 1.0241 1.0239 1.0033 1.0045 1.0230 1.0034 1.0056 1.0148
dispcorr: -0.016914603 hartree
energy: -2830.796545643617
dipole: 38.77763 -36.89114 1.88649 5.58385 -5.05616 0.52769 0.89750 -0.87322 0.02428
magnitude: 1.95906 au
magnitude: 4.97953 debye
