program: Orca
programVersion: 5.0.2
elementType: Cl Cl Cl Cl S O O N C C C C C C C C C C H H H H H H H H H
charge: 0
multiplicity: 1
keywords: wb97x-d3
keywords: def2-TZVPP
keywords: def2/J RIJCOSX
keywords: DEFGRID2
keywords: scfconv7
keywords: smallprint printgap noloewdin
keywords: NOSOSCF
formula: C10H9Cl4NO2S
InChI: InChI=1/C10H9Cl4NO2S/c11-9(12)10(13,14)18-15-7(16)5-3-1-2-4-6(5)8(15)17/h1-2,5-6,9H,3-4H2
27 atoms
Cl -2.884769 -1.709752 -0.501744
Cl -0.995182 -1.002464 1.581713
Cl -2.864714 1.348585 -1.481511
Cl -3.514717 0.929729 1.304779
S  -0.345925 -0.66224 -1.296095
O  1.772788 -2.530308 -0.19226
O  0.894148 1.941573 -0.268409
N  1.059132 -0.347023 -0.427053
C  3.212243 -0.651701 0.419291
C  2.687937 0.718367 0.857022
C  4.18451 -0.578142 -0.770612
C  3.684483 1.871282 0.896508
C  1.966405 -1.363271 -0.056414
C  1.472214 0.924087 -0.019753
C  5.129796 0.575277 -0.674698
C  4.896436 1.660829 0.050313
C  -1.643618 -0.564134 0.002483
C  -2.237866 0.850991 0.088841
H  3.677837 -1.19703 1.239833
H  2.256341 0.601416 1.859392
H  3.634786 -0.501313 -1.716197
H  4.731169 -1.520235 -0.833559
H  4.005261 2.038173 1.928253
H  3.181132 2.796587 0.60286
H  6.036193 0.512952 -1.265026
H  5.624859 2.463299 0.053058
H  -1.452501 1.549686 0.368313
totalener: -2830.77758300 hartree
nucrepener: 2167.39671653 hartree
electener: -4998.17429953 hartree
oneelecener: -8213.62748938 hartree
twoeener: 3215.45318985 hartree
kineticenergy: 2825.12064992 hartree
xcener: -159.725050225694 hartree
chargesum: -0.0000000
charge: -0.027514 -0.054383 -0.055462 -0.062865 0.084318 -0.268354 -0.326537 -0.130789 0.141830 -0.031288 -0.158672 -0.050884 0.125386 0.173265 -0.159817 -0.193612 0.109718 -0.055799 0.092244 0.093746 0.086443 0.100656 0.083025 0.093428 0.114748 0.112012 0.165156
qa: -0.0275 -0.0544 -0.0555 -0.0629 0.0843 -0.2684 -0.3265 -0.1308 0.1418 -0.0313 -0.1587 -0.0509 0.1254 0.1733 -0.1598 -0.1936 0.1097 -0.0558 0.0922 0.0937 0.0864 0.1007 0.0830 0.0934 0.1147 0.1120 0.1652
va: 1.2875 1.2682 1.2331 1.2273 2.3039 2.2336 2.1744 3.1146 3.7517 3.8822 3.9899 3.9276 4.2738 4.2524 3.8517 3.9426 4.3100 4.3256 1.0148 1.0266 1.0020 1.0127 1.0016 1.0208 1.0074 1.0057 1.0119
dispcorr: -0.015547234 hartree
energy: -2830.793130235538
dipole: 43.60413 -41.90772 1.69641 6.94171 -6.47625 0.46546 1.01266 -0.46605 0.54661
magnitude: 1.84207 au
magnitude: 4.68218 debye
