program: Orca
programVersion: 5.0.2
elementType: Cl Cl Cl Cl S O O N C C C C C C C C C C H H H H H H H H H
charge: 0
multiplicity: 1
keywords: wb97x-d3
keywords: def2-TZVPP
keywords: def2/J RIJCOSX
keywords: DEFGRID2
keywords: scfconv7
keywords: smallprint printgap noloewdin
keywords: NOSOSCF
formula: C10H9Cl4NO2S
InChI: InChI=1/C10H9Cl4NO2S/c11-9(12)10(13,14)18-15-7(16)5-3-1-2-4-6(5)8(15)17/h1-2,5-6,9H,3-4H2
27 atoms
Cl -2.763673 -1.711303 -0.62422
Cl -1.024717 -1.036003 1.591053
Cl -2.851946 1.392089 -1.435189
Cl -3.62593 0.788176 1.284675
S  -0.246139 -0.478913 -1.228665
O  1.931571 -2.364613 -0.357385
O  0.80614 2.010259 0.178626
N  1.107914 -0.219724 -0.261632
C  3.151863 -0.630684 0.83806
C  2.754352 0.837939 1.046489
C  4.491972 -0.815015 0.106872
C  3.793868 1.848653 0.542566
C  2.030444 -1.237998 0.019498
C  1.456269 1.010201 0.286463
C  4.620167 0.166934 -1.018522
C  4.294206 1.438524 -0.80957
C  -1.610526 -0.536057 0.0071
C  -2.283408 0.839954 0.140299
H  3.18527 -1.172414 1.78634
H  2.534574 1.040665 2.098182
H  4.57858 -1.845383 -0.236774
H  5.302095 -0.662215 0.827633
H  4.622124 1.881704 1.258168
H  3.355805 2.846165 0.532079
H  4.981154 -0.171149 -1.981286
H  4.37748 2.179174 -1.59439
H  -1.548741 1.557489 0.498694
totalener: -2830.77993057 hartree
nucrepener: 2178.95816564 hartree
electener: -5009.73809621 hartree
oneelecener: -8236.96381846 hartree
twoeener: 3227.22572224 hartree
kineticenergy: 2825.12389810 hartree
xcener: -159.724181259476 hartree
chargesum: 0.0000000
charge: -0.028555 -0.054473 -0.057810 -0.063608 0.088353 -0.285882 -0.339809 -0.112291 0.022509 0.086346 -0.111883 -0.133329 0.157874 0.139805 -0.192937 -0.167811 0.102978 -0.052620 0.089004 0.089566 0.108110 0.093364 0.094692 0.105019 0.126654 0.127530 0.169202
qa: -0.0286 -0.0545 -0.0578 -0.0636 0.0884 -0.2859 -0.3398 -0.1123 0.0225 0.0863 -0.1119 -0.1333 0.1579 0.1398 -0.1929 -0.1678 0.1030 -0.0526 0.0890 0.0896 0.1081 0.0934 0.0947 0.1050 0.1267 0.1275 0.1692
va: 1.2854 1.2672 1.2318 1.2269 2.2930 2.2199 2.1629 3.1220 3.8534 3.7834 3.9574 3.9700 4.2199 4.2434 3.8617 3.8295 4.3078 4.3128 1.0265 1.0270 1.0210 1.0040 1.0034 1.0227 1.0042 1.0038 1.0149
dispcorr: -0.015752907 hartree
energy: -2830.795683480736
dipole: 43.35390 -41.59914 1.75476 6.10302 -5.67358 0.42944 1.92589 -1.21241 0.71348
magnitude: 1.94233 au
magnitude: 4.93702 debye
