program: Orca
programVersion: 5.0.2
elementType: Cl Cl Cl N N N N C C C C C C C C C H H H H H
charge: 0
multiplicity: 1
keywords: wb97x-d3
keywords: def2-TZVPP
keywords: def2/J RIJCOSX
keywords: DEFGRID2
keywords: scfconv7
keywords: smallprint printgap noloewdin
keywords: NOSOSCF
formula: C9H5Cl3N4
InChI: InChI=1/C9H5Cl3N4/c10-5-3-1-2-4-6(5)13-9-15-7(11)14-8(12)16-9/h1-4,13H
21 atoms
Cl -3.260036 2.194311 -0.000786
Cl 3.739678 2.293863 -0.000152
Cl 2.774683 -2.768309 -0.001017
N  -0.788473 0.601005 0.0019
N  0.913412 -0.991812 0.000783
N  1.355193 1.326248 0.001303
N  3.134921 -0.214557 -0.000394
C  -1.938051 -0.189626 0.001036
C  -3.180949 0.459504 -0.000412
C  -1.940564 -1.584835 0.001555
C  0.512074 0.279117 0.001255
C  -4.370566 -0.246096 -0.001585
C  -3.133181 -2.289776 0.000379
C  -4.351366 -1.631061 -0.00126
C  2.614872 1.002855 0.000461
C  2.210743 -1.151743 0.000084
H  -0.942737 1.60126 0.002191
H  -1.01025 -2.126171 0.002812
H  -5.309868 0.289577 -0.002779
H  -3.098152 -3.370662 0.000754
H  -5.281066 -2.182567 -0.002241
elementType: Cl N C H
totalener: -1945.68243704 hartree
nucrepener: 1332.63211164 hartree
electener: -3278.31454868 hartree
oneelecener: -5321.27208299 hartree
twoeener: 2042.95753431 hartree
cpcmener: -0.01338171 hartree
kineticenergy: 1941.48064929 hartree
xcener: -117.433680547572 hartree
chargesum: -0.0000000
charge: -0.092459 -0.018817 -0.019081 -0.116942 -0.362723 -0.365869 -0.323025 0.173099 -0.011048 -0.203103 0.489540 -0.103004 -0.133706 -0.183540 0.238620 0.234167 0.167063 0.163222 0.142776 0.161936 0.162895
qa: -0.0925 -0.0188 -0.0191 -0.1169 -0.3627 -0.3659 -0.3230 0.1731 -0.0110 -0.2031 0.4895 -0.1030 -0.1337 -0.1835 0.2386 0.2342 0.1671 0.1632 0.1428 0.1619 0.1629
va: 1.2392 1.2856 1.2856 3.2475 3.0094 3.0091 2.9774 3.8046 3.8849 3.8822 4.0678 3.9304 3.9106 3.9258 4.4043 4.3934 1.0566 1.0357 1.0032 0.9900 0.9875
dispcorr: -0.008656849 hartree
energy: -1945.691093888475
dipole: -19.02052 17.29544 -1.72509 -7.73753 7.32728 -0.41025 0.00334 -0.00271 0.00063
magnitude: 1.77320 au
magnitude: 4.50712 debye
