program: Orca
programVersion: 5.0.2
elementType: Cl Cl Cl N N N N C C C C C C C C C H H H H H
charge: 0
multiplicity: 1
keywords: wb97x-d3
keywords: def2-TZVPP
keywords: def2/J RIJCOSX
keywords: DEFGRID2
keywords: scfconv7
keywords: smallprint printgap noloewdin
keywords: NOSOSCF
formula: C9H5Cl3N4
InChI: InChI=1/C9H5Cl3N4/c10-5-3-1-2-4-6(5)13-9-15-7(11)14-8(12)16-9/h1-4,13H
21 atoms
Cl -3.263814 2.195677 -0.000796
Cl 3.743191 2.291401 -0.000122
Cl 2.767737 -2.773213 -0.000987
N  -0.790217 0.604428 0.001866
N  0.90992 -0.990055 0.000778
N  1.355832 1.324905 0.00129
N  3.130945 -0.217732 -0.000383
C  -1.938714 -0.186468 0.001035
C  -3.182721 0.460676 -0.000403
C  -1.937759 -1.582202 0.001539
C  0.510074 0.281022 0.001253
C  -4.370696 -0.247642 -0.001569
C  -3.129139 -2.288944 0.000372
C  -4.348478 -1.632464 -0.00125
C  2.615182 1.00081 0.000452
C  2.206642 -1.153815 0.000078
H  -0.941109 1.605465 0.002202
H  -1.005197 -2.121094 0.002774
H  -5.311492 0.285896 -0.002755
H  -3.092506 -3.370118 0.000736
H  -5.277362 -2.186007 -0.002225
elementType: Cl N C H
totalener: -1945.69045393 hartree
nucrepener: 1332.56304573 hartree
electener: -3278.25349966 hartree
oneelecener: -5321.13715431 hartree
twoeener: 2042.88365465 hartree
cpcmener: -0.01188156 hartree
kineticenergy: 1941.47690186 hartree
xcener: -117.433329845171 hartree
chargesum: 0.0000000
charge: -0.091523 -0.017499 -0.018429 -0.119685 -0.361740 -0.362978 -0.316580 0.171355 -0.012321 -0.199661 0.486003 -0.101645 -0.130266 -0.180041 0.235205 0.231982 0.166052 0.162998 0.140644 0.158621 0.159508
qa: -0.0915 -0.0175 -0.0184 -0.1197 -0.3617 -0.3630 -0.3166 0.1714 -0.0123 -0.1997 0.4860 -0.1016 -0.1303 -0.1800 0.2352 0.2320 0.1661 0.1630 0.1406 0.1586 0.1595
va: 1.2401 1.2861 1.2855 3.2453 3.0103 3.0099 2.9805 3.8096 3.8913 3.8869 4.0692 3.9348 3.9160 3.9302 4.4060 4.3927 1.0577 1.0362 1.0038 0.9912 0.9888
dispcorr: -0.008661051 hartree
energy: -1945.699114984922
dipole: -18.99652 17.33364 -1.66288 -7.72651 7.32948 -0.39703 0.00326 -0.00266 0.00060
magnitude: 1.70962 au
magnitude: 4.34551 debye
