program: Orca
programVersion: 5.0.2
elementType: Cl Cl Cl N N N N C C C C C C C C C H H H H H
charge: 0
multiplicity: 1
keywords: wb97x-d3
keywords: def2-TZVPP
keywords: def2/J RIJCOSX
keywords: DEFGRID2
keywords: scfconv7
keywords: smallprint printgap noloewdin
keywords: NOSOSCF
formula: C9H5Cl3N4
InChI: InChI=1/C9H5Cl3N4/c10-5-3-1-2-4-6(5)13-9-15-7(11)14-8(12)16-9/h1-4,13H
21 atoms
Cl -3.253867 2.193869 -0.000873
Cl 3.733551 2.297127 0.000022
Cl 2.773656 -2.770937 -0.000814
N  -0.791836 0.599338 0.001851
N  0.90924 -0.995258 0.000744
N  1.349263 1.324012 0.001191
N  3.12929 -0.214176 -0.000298
C  -1.939821 -0.190417 0.000991
C  -3.180918 0.460193 -0.000398
C  -1.938723 -1.585594 0.001445
C  0.512592 0.27542 0.00119
C  -4.369036 -0.246303 -0.001485
C  -3.131447 -2.288577 0.000337
C  -4.349295 -1.630365 -0.00117
C  2.61351 1.005068 0.000446
C  2.210972 -1.155238 0.000059
H  -0.943174 1.598582 0.002114
H  -1.002468 -2.11791 0.002573
H  -5.305229 0.293952 -0.002611
H  -3.097637 -3.369418 0.000659
H  -5.278303 -2.182844 -0.002087
totalener: -1945.67177140 hartree
nucrepener: 1333.06514253 hartree
electener: -3278.73691394 hartree
oneelecener: -5322.18761541 hartree
twoeener: 2043.45070147 hartree
kineticenergy: 1941.49966165 hartree
xcener: -117.437136521227 hartree
chargesum: -0.0000000
charge: -0.082548 -0.001132 -0.006197 -0.142728 -0.351824 -0.335359 -0.266304 0.151382 -0.016760 -0.171167 0.454384 -0.089815 -0.096491 -0.145916 0.200233 0.208442 0.155363 0.156535 0.120310 0.130198 0.129395
qa: -0.0825 -0.0011 -0.0062 -0.1427 -0.3518 -0.3354 -0.2663 0.1514 -0.0168 -0.1712 0.4544 -0.0898 -0.0965 -0.1459 0.2002 0.2084 0.1554 0.1565 0.1203 0.1302 0.1294
va: 1.2515 1.3017 1.2968 3.2211 3.0122 3.0060 2.9951 3.8600 3.9431 3.9416 4.0724 3.9765 3.9574 3.9734 4.4195 4.3901 1.0718 1.0397 1.0099 1.0007 0.9994
dispcorr: -0.008662847 hartree
energy: -1945.680434248170
dipole: -19.00442 17.80675 -1.19767 -7.72725 7.41037 -0.31689 0.00284 -0.00256 0.00028
magnitude: 1.23888 au
magnitude: 3.14899 debye
