program: Orca
programVersion: 5.0.2
elementType: Cl S O N N N C C C C C C C C C C C H H H H H H H H H H
charge: 0
multiplicity: 1
keywords: wb97x-d3
keywords: def2-TZVPP
keywords: def2/J RIJCOSX
keywords: DEFGRID2
keywords: scfconv7
keywords: smallprint printgap noloewdin
keywords: NOSOSCF
formula: C11H10ClN3OS
InChI: InChI=1/C11H10ClN3OS/c1-6-3-4-8(5-9(6)12)13-11(16)10-7(2)14-15-17-10/h3-5,13H,1-2H3
27 atoms
Cl -4.109548 1.356068 -0.750487
S  1.606371 1.315037 0.403793
O  2.485358 -1.199479 -2.329947
N  0.35619 -0.88291 -1.676952
N  3.604463 0.361657 1.439006
N  2.824655 1.354278 1.545958
C  -0.662238 -0.624842 -0.737433
C  -2.750144 -0.107389 1.076164
C  -1.741339 0.159331 -1.12357
C  -0.626054 -1.164994 0.541695
C  -2.767241 0.393145 -0.224337
C  -1.650231 -0.885835 1.429823
C  2.195447 -0.12263 -0.275788
C  1.690735 -0.787666 -1.504399
C  3.312356 -0.499561 0.427072
C  -3.857069 0.155342 2.046778
C  4.172171 -1.691898 0.20076
H  -1.774838 0.581996 -2.119432
H  0.191451 -1.805553 0.845788
H  0.064704 -1.215803 -2.58859
H  -1.607099 -1.303259 2.427981
H  -4.805645 -0.252928 1.694021
H  -3.638437 -0.299438 3.011535
H  -4.00778 1.223707 2.208831
H  4.737123 -1.919302 1.10285
H  3.584877 -2.568597 -0.065949
H  4.886119 -1.5144 -0.604157
elementType: Cl S O N C H
totalener: -1523.14324032 hartree
nucrepener: 1401.76246267 hartree
electener: -2924.90570299 hartree
oneelecener: -4872.82340002 hartree
twoeener: 1947.91769703 hartree
cpcmener: -0.02568737 hartree
kineticenergy: 1519.02725082 hartree
xcener: -104.214323020827 hartree
chargesum: 0.0000000
charge: -0.086683 0.244560 -0.457056 -0.129913 -0.117147 -0.225073 0.046992 -0.009136 -0.158082 -0.165550 0.054856 -0.101813 -0.044425 0.354048 0.024241 -0.219248 -0.261837 0.133131 0.153964 0.185768 0.145765 0.107071 0.093598 0.105461 0.104410 0.109451 0.112647
qa: -0.0867 0.2446 -0.4571 -0.1299 -0.1171 -0.2251 0.0470 -0.0091 -0.1581 -0.1655 0.0549 -0.1018 -0.0444 0.3540 0.0242 -0.2192 -0.2618 0.1331 0.1540 0.1858 0.1458 0.1071 0.0936 0.1055 0.1044 0.1095 0.1126
va: 1.2404 2.8689 2.0580 3.1840 3.0004 2.8962 3.7316 3.7052 4.0846 3.9525 3.9239 3.8868 3.7054 4.1948 4.0067 3.9082 3.9801 1.0237 1.0005 1.0088 0.9973 0.9965 1.0058 0.9981 1.0117 0.9987 0.9988
dispcorr: -0.012961805 hartree
energy: -1523.156202124898
dipole: 3.14058 -4.98482 -1.84423 -10.72601 9.64818 -1.07783 6.64650 -6.59700 0.04950
magnitude: 2.13667 au
magnitude: 5.43099 debye
