program: Orca
programVersion: 5.0.2
elementType: S O O O N C C C C C C C C C C H H H H H H H H H
charge: 0
multiplicity: 1
keywords: wb97x-d3
keywords: def2-TZVPP
keywords: def2/J RIJCOSX
keywords: DEFGRID2
keywords: scfconv7
keywords: smallprint printgap noloewdin
keywords: NOSOSCF
formula: C10H9NO3S
InChI: InChI=1/C10H9NO3S/c1-2-7-14-10-8-5-3-4-6-9(8)15(12,13)11-10/h2-6H,1,7H2
24 atoms
S  0.664317 1.540055 -0.151697
O  -1.649268 -1.320451 -0.384851
O  0.695464 2.276397 1.100715
O  1.00447 2.254211 -1.369618
N  -0.816729 0.814013 -0.327271
C  1.585924 0.031885 -0.008395
C  0.675972 -1.007283 -0.073434
C  -0.681072 -0.464842 -0.268335
C  2.935851 -0.166801 0.164409
C  1.098266 -2.318211 0.041133
C  3.363002 -1.487856 0.276133
C  2.45912 -2.543114 0.21963
C  -3.0036 -0.837877 -0.552984
C  -3.592078 -0.422522 0.751552
C  -4.188826 0.746498 0.936227
H  3.63853 0.653886 0.211644
H  0.401375 -3.143762 -0.003587
H  4.415616 -1.694487 0.412327
H  2.821325 -3.557256 0.315734
H  -3.025213 -0.033279 -1.288671
H  -3.532996 -1.697552 -0.961679
H  -3.564833 -1.157454 1.549374
H  -4.661567 0.994642 1.877184
H  -4.234775 1.493936 0.153514
elementType: S O N C H
totalener: -1065.13796480 hartree
nucrepener: 1121.81403886 hartree
electener: -2186.95200366 hartree
oneelecener: -3685.25799381 hartree
twoeener: 1498.30599015 hartree
cpcmener: -0.03695466 hartree
kineticenergy: 1061.50320381 hartree
xcener: -81.780108628699 hartree
chargesum: -0.0000000
charge: 0.872820 -0.252910 -0.526295 -0.525094 -0.358610 -0.112738 0.060401 0.405018 -0.102890 -0.195920 -0.118575 -0.094929 0.108296 -0.208405 -0.248264 0.159635 0.159390 0.167960 0.168377 0.113717 0.125163 0.145426 0.135382 0.123046
qa: 0.8728 -0.2529 -0.5263 -0.5251 -0.3586 -0.1127 0.0604 0.4050 -0.1029 -0.1959 -0.1186 -0.0949 0.1083 -0.2084 -0.2483 0.1596 0.1594 0.1680 0.1684 0.1137 0.1252 0.1454 0.1354 0.1230
va: 5.7840 2.2220 1.9405 1.9428 2.8741 3.8155 3.5541 4.0791 3.9083 4.0181 3.9075 3.8749 3.7838 3.8235 3.9373 0.9976 1.0043 0.9860 0.9875 1.0107 0.9922 1.0008 1.0009 1.0074
dispcorr: -0.009627176 hartree
energy: -1065.147591975905
dipole: -7.69262 7.47884 -0.21378 -7.71382 3.86776 -3.84606 2.11016 -1.99775 0.11241
magnitude: 3.85363 au
magnitude: 9.79516 debye
