program: Orca
programVersion: 5.0.2
elementType: S O O O N C C C C C C C C C C H H H H H H H H H
charge: 0
multiplicity: 1
keywords: wb97x-d3
keywords: def2-TZVPP
keywords: def2/J RIJCOSX
keywords: DEFGRID2
keywords: scfconv7
keywords: smallprint printgap noloewdin
keywords: NOSOSCF
formula: C10H9NO3S
InChI: InChI=1/C10H9NO3S/c1-2-7-14-10-8-5-3-4-6-9(8)15(12,13)11-10/h2-6H,1,7H2
24 atoms
S  0.851645 1.642676 0.038757
O  -1.733045 -0.955227 0.465946
O  1.308602 2.344826 1.223134
O  0.903944 2.329351 -1.238344
N  -0.686617 1.074886 0.29882
C  1.606432 0.039369 -0.079789
C  0.603328 -0.898208 0.086623
C  -0.686097 -0.211205 0.296404
C  2.919879 -0.305414 -0.300722
C  0.890474 -2.249626 0.041567
C  3.210073 -1.666785 -0.346245
C  2.2127 -2.621031 -0.177393
C  -3.031699 -0.348073 0.671951
C  -4.015339 -1.067128 -0.182477
C  -4.857086 -0.437073 -0.990155
H  3.696768 0.435489 -0.43286
H  0.119349 -2.996965 0.171297
H  4.229529 -1.986097 -0.516639
H  2.47032 -3.670693 -0.217672
H  -3.257206 -0.465493 1.734279
H  -2.999364 0.715486 0.438786
H  -4.050936 -2.147856 -0.087849
H  -5.592015 -0.978656 -1.570969
H  -4.845232 0.640935 -1.101285
elementType: S O N C H
totalener: -1065.13606066 hartree
nucrepener: 1108.20781163 hartree
electener: -2173.34387229 hartree
oneelecener: -3657.75134154 hartree
twoeener: 1484.40746924 hartree
cpcmener: -0.02970705 hartree
kineticenergy: 1061.50061048 hartree
xcener: -81.778513445798 hartree
chargesum: -0.0000000
charge: 0.866540 -0.246849 -0.509841 -0.509843 -0.353028 -0.110504 0.050451 0.398836 -0.103158 -0.192583 -0.117706 -0.097002 0.089094 -0.197577 -0.240253 0.157337 0.156973 0.165205 0.164628 0.119687 0.114442 0.141289 0.131592 0.122272
qa: 0.8665 -0.2468 -0.5098 -0.5098 -0.3530 -0.1105 0.0505 0.3988 -0.1032 -0.1926 -0.1177 -0.0970 0.0891 -0.1976 -0.2403 0.1573 0.1570 0.1652 0.1646 0.1197 0.1144 0.1413 0.1316 0.1223
va: 5.7960 2.2182 1.9603 1.9607 2.8967 3.8293 3.5516 4.0815 3.9133 4.0121 3.9109 3.8816 3.7848 3.8688 3.9416 0.9988 1.0057 0.9870 0.9890 0.9928 1.0172 1.0024 1.0016 1.0066
dispcorr: -0.009103756 hartree
energy: -1065.145164419196
dipole: -9.66577 9.05918 -0.60659 -9.77116 6.12933 -3.64183 -1.45019 1.51013 0.05993
magnitude: 3.69249 au
magnitude: 9.38557 debye
