program: Orca
programVersion: 5.0.2
elementType: S O O O N C C C C C C C C C C H H H H H H H H H
charge: 0
multiplicity: 1
keywords: wb97x-d3
keywords: def2-TZVPP
keywords: def2/J RIJCOSX
keywords: DEFGRID2
keywords: scfconv7
keywords: smallprint printgap noloewdin
keywords: NOSOSCF
formula: C10H9NO3S
InChI: InChI=1/C10H9NO3S/c1-2-7-14-10-8-5-3-4-6-9(8)15(12,13)11-10/h2-6H,1,7H2
24 atoms
S  1.004774 1.677979 0.250627
O  -1.789625 -0.727941 0.062716
O  1.369687 2.207535 1.549582
O  1.259653 2.487216 -0.924986
N  -0.592438 1.214547 0.272145
C  1.651663 0.038896 0.033377
C  0.573962 -0.825167 -0.015606
C  -0.679816 -0.058901 0.11735
C  2.954491 -0.387688 -0.077104
C  0.769295 -2.184164 -0.172656
C  3.153057 -1.756863 -0.234342
C  2.079168 -2.639109 -0.278246
C  -3.055242 -0.028542 0.13029
C  -4.051098 -0.850335 -0.609673
C  -5.153986 -1.336618 -0.05786
H  3.789849 0.298345 -0.04317
H  -0.062621 -2.874275 -0.209964
H  4.160967 -2.139267 -0.322764
H  2.266201 -3.697576 -0.397586
H  -3.322489 0.098749 1.180947
H  -2.946987 0.958593 -0.323464
H  -3.851786 -1.008625 -1.664885
H  -5.873323 -1.896201 -0.641682
H  -5.383435 -1.193603 0.991534
elementType: S O N C H
totalener: -1065.13738170 hartree
nucrepener: 1104.33103901 hartree
electener: -2169.46842072 hartree
oneelecener: -3649.91500054 hartree
twoeener: 1480.44657983 hartree
cpcmener: -0.02958411 hartree
kineticenergy: 1061.50672828 hartree
xcener: -81.778374289421 hartree
chargesum: -0.0000000
charge: 0.867551 -0.244931 -0.508380 -0.508009 -0.351784 -0.113622 0.065074 0.388790 -0.101378 -0.198024 -0.119883 -0.093992 0.079313 -0.209281 -0.232387 0.156979 0.157095 0.164950 0.164202 0.124471 0.117265 0.142938 0.131998 0.121043
qa: 0.8676 -0.2449 -0.5084 -0.5080 -0.3518 -0.1136 0.0651 0.3888 -0.1014 -0.1980 -0.1199 -0.0940 0.0793 -0.2093 -0.2324 0.1570 0.1571 0.1650 0.1642 0.1245 0.1173 0.1429 0.1320 0.1210
va: 5.7962 2.2121 1.9636 1.9628 2.8913 3.8319 3.5602 4.0848 3.9136 4.0172 3.9140 3.8794 3.7845 3.8635 3.9459 0.9989 1.0059 0.9871 0.9892 1.0017 1.0049 1.0011 1.0018 1.0094
dispcorr: -0.009026661 hartree
energy: -1065.146408364570
dipole: -10.73601 9.88073 -0.85528 -10.81524 7.24778 -3.56746 -1.61928 1.17650 -0.44278
magnitude: 3.69518 au
magnitude: 9.39239 debye
