program: Orca
programVersion: 5.0.2
elementType: Cl Cl S S O O O N N C C C C C C C C C C C H H H H H H
charge: 0
multiplicity: 1
keywords: wb97x-d3
keywords: def2-TZVPP
keywords: def2/J RIJCOSX
keywords: DEFGRID2
keywords: scfconv7
keywords: smallprint printgap noloewdin
keywords: NOSOSCF
formula: C11H6Cl2N2O3S2
InChI: InChI=1/C11H6Cl2N2O3S2/c12-9-7(19-14-10(9)13)5-18-11-6-3-1-2-4-8(6)20(16,17)15-11/h1-4H,5H2
26 atoms
Cl 4.025848 1.108044 -0.554913
Cl 5.66373 -1.404661 0.830713
S  -3.128819 1.958548 -1.146642
S  1.637846 -1.911394 1.042842
O  -0.377134 -0.169083 0.095902
O  -3.410441 1.925478 -2.56794
O  -3.419889 3.168211 -0.403412
N  -1.535472 1.527664 -0.893034
N  3.231194 -2.270031 1.262973
C  -3.812386 0.540844 -0.326914
C  -2.755259 -0.22897 0.125404
C  -1.488747 0.420159 -0.249695
C  -5.127285 0.195936 -0.121839
C  -2.985826 -1.403134 0.816982
C  0.853507 0.460849 -0.260453
C  -5.361062 -0.987093 0.575022
C  -4.309217 -1.77139 1.035367
C  1.928177 -0.430228 0.242505
C  3.271813 -0.240771 0.16218
C  3.960684 -1.328208 0.762826
H  -5.945693 0.806407 -0.478915
H  -2.172307 -2.017851 1.178543
H  0.921044 1.449984 0.199857
H  0.921465 0.577174 -1.345302
H  -6.379886 -1.299446 0.760771
H  -4.524243 -2.684485 1.573599
elementType: Cl S O N C H
totalener: -2474.83537259 hartree
nucrepener: 2035.39200070 hartree
electener: -4510.22737329 hartree
oneelecener: -7450.88978536 hartree
twoeener: 2940.66241207 hartree
cpcmener: -0.03180437 hartree
kineticenergy: 2468.97783132 hartree
xcener: -150.947594872480 hartree
chargesum: 0.0000000
charge: -0.036328 -0.029998 0.866401 0.221488 -0.256419 -0.502094 -0.501906 -0.339763 -0.277636 -0.104730 0.060624 0.374245 -0.105279 -0.195855 0.059256 -0.116078 -0.092817 0.061878 -0.133869 0.108316 0.158889 0.159072 0.145490 0.146192 0.165542 0.165381
qa: -0.0363 -0.0300 0.8664 0.2215 -0.2564 -0.5021 -0.5019 -0.3398 -0.2776 -0.1047 0.0606 0.3742 -0.1053 -0.1959 0.0593 -0.1161 -0.0928 0.0619 -0.1339 0.1083 0.1589 0.1591 0.1455 0.1462 0.1655 0.1654
va: 1.2884 1.2905 5.7852 2.7882 2.2107 1.9725 1.9729 2.8939 2.9625 3.8297 3.5704 4.0910 3.9202 4.0086 3.7674 3.9091 3.8837 3.7749 4.1500 4.2589 0.9983 0.9994 0.9913 0.9905 0.9869 0.9886
dispcorr: -0.012333005 hartree
energy: -2474.847705593411
dipole: -29.14978 28.24126 -0.90851 -2.49738 0.20819 -2.28919 1.35825 -0.01013 1.34812
magnitude: 2.80770 au
magnitude: 7.13662 debye
