program: Orca
programVersion: 5.0.2
elementType: Cl Cl Cl Cl Cl Cl O O O N C C C C C C C C C C C C C C H H H H H
charge: 0
multiplicity: 1
keywords: wb97x-d3
keywords: def2-TZVPP
keywords: def2/J RIJCOSX
keywords: DEFGRID2
keywords: scfconv7
keywords: smallprint printgap noloewdin
keywords: NOSOSCF
formula: C14H5Cl6NO3
InChI: InChI=1/C14H5Cl6NO3/c15-4-2-1-3-5(8(4)16)21-13(22)6-7(14(23)24)10(18)12(20)11(19)9(6)17/h1-3,21,23H
29 atoms
Cl -0.277753 -1.775757 -1.441097
Cl 3.806635 1.843176 1.49723
Cl 1.810482 -3.028052 0.471931
Cl 3.834419 -1.215318 1.958941
Cl -3.634815 -0.764404 -1.986767
Cl -4.987878 -1.96102 0.562798
O  0.251157 1.796596 -2.740568
O  2.798046 3.33505 -0.982962
O  0.73954 3.553114 -0.128771
N  -1.490647 1.192346 -1.445881
C  0.786746 0.604565 -0.785675
C  1.749121 1.407556 -0.184677
C  -0.179319 1.246605 -1.742999
C  0.824106 -0.768776 -0.601509
C  2.685194 0.846764 0.669699
C  -2.07349 0.640908 -0.293575
C  1.77383 -1.339056 0.240492
C  2.693589 -0.527012 0.89459
C  -3.110723 -0.285708 -0.423142
C  -1.65444 1.02144 0.974425
C  1.699545 2.886592 -0.420539
C  -3.702624 -0.82582 0.712289
C  -2.230842 0.453808 2.097642
C  -3.257168 -0.466366 1.974295
H  -2.110414 1.536744 -2.16976
H  -0.888528 1.776857 1.082451
H  -1.89256 0.748278 3.081202
H  -3.718895 -0.896833 2.852037
H  2.757201 4.299497 -1.102859
elementType: Cl O N C H
totalener: -3578.29616879 hartree
nucrepener: 3125.95261478 hartree
electener: -6704.24878357 hartree
twoeener: 4448.71077345 hartree
cpcmener: -0.03364353 hartree
kineticenergy: 3571.23709887 hartree
xcener: -203.068845493079 hartree
chargesum: 0.0000000
charge: -0.023872 -0.018312 -0.013449 -0.015675 -0.046929 -0.062314 -0.463770 -0.274318 -0.409681 -0.126109 0.016617 0.022464 0.291079 0.090088 0.033880 0.144474 -0.016341 -0.013873 -0.068267 -0.154477 0.366668 0.089466 -0.147749 -0.131409 0.183045 0.161390 0.163633 0.146081 0.277660
qa: -0.0239 -0.0183 -0.0134 -0.0157 -0.0469 -0.0623 -0.4638 -0.2743 -0.4097 -0.1261 0.0166 0.0225 0.2911 0.0901 0.0339 0.1445 -0.0163 -0.0139 -0.0683 -0.1545 0.3667 0.0895 -0.1477 -0.1314 0.1830 0.1614 0.1636 0.1461 0.2777
va: 1.3273 1.3233 1.3268 1.3232 1.2966 1.2568 2.0432 2.2401 2.0627 3.1949 3.5720 3.6735 4.2401 3.9577 4.0564 3.6271 4.0657 4.0667 4.0298 3.9400 4.3125 3.8831 3.9827 3.9799 1.0181 1.0127 0.9890 1.0033 0.9772
dispcorr: -0.020760923 hartree
energy: -3578.316929715258
dipole: -6.14345 6.29248 0.14903 16.23326 -15.83902 0.39424 1.99732 -0.41783 1.57949
magnitude: 1.63476 au
magnitude: 4.15522 debye
