program: Orca
programVersion: 5.0.2
elementType: Cl Cl Cl Cl Cl Cl O O O N C C C C C C C C C C C C C C H H H H H
charge: 0
multiplicity: 1
keywords: wb97x-d3
keywords: def2-TZVPP
keywords: def2/J RIJCOSX
keywords: DEFGRID2
keywords: scfconv7
keywords: smallprint printgap noloewdin
keywords: NOSOSCF
formula: C14H5Cl6NO3
InChI: InChI=1/C14H5Cl6NO3/c15-4-2-1-3-5(8(4)16)21-13(22)6-7(14(23)24)10(18)12(20)11(19)9(6)17/h1-3,21,23H
29 atoms
Cl 0.249042 -1.958524 1.809047
Cl 4.244152 1.846982 -1.02027
Cl 3.138916 -2.899954 1.202216
Cl 5.12377 -0.994073 -0.218564
Cl -2.816367 -1.155935 -1.930518
Cl -5.894063 -0.73863 -1.991616
O  -0.628708 1.610159 1.893945
O  0.246241 2.642278 -0.92893
O  2.026208 3.61653 0.014637
N  -1.414752 0.2896 0.192865
C  0.932025 0.360944 0.632278
C  1.835476 1.238665 0.038552
C  -0.45848 0.832851 0.988756
C  1.343099 -0.909236 1.00645
C  3.135915 0.819865 -0.221877
C  -2.789075 0.502907 0.215165
C  2.644303 -1.333262 0.75127
C  3.53813 -0.469634 0.124051
C  -3.569629 -0.13541 -0.76009
C  -3.42549 1.315583 1.15206
C  1.409393 2.638674 -0.279061
C  -4.946019 0.045464 -0.792817
C  -4.798222 1.483005 1.103355
C  -5.568016 0.858683 0.139761
H  -1.082474 -0.309096 -0.547752
H  -2.849083 1.812037 1.914134
H  -5.275999 2.117014 1.837433
H  -6.639339 0.99315 0.104412
H  -0.044865 3.557521 -1.045354
totalener: -3578.28396986 hartree
nucrepener: 2986.85763399 hartree
electener: -6565.14160385 hartree
twoeener: 4309.35492886 hartree
kineticenergy: 3571.27975104 hartree
xcener: -203.067025885216 hartree
chargesum: -0.0000000
charge: -0.010213 0.005202 0.001914 -0.002551 -0.063267 -0.044786 -0.348979 -0.261001 -0.289411 -0.140080 -0.059512 0.045862 0.352464 0.023679 0.002496 0.191230 -0.039782 -0.004627 -0.079346 -0.203468 0.303482 0.091545 -0.098641 -0.156345 0.156164 0.157909 0.132372 0.122144 0.215545
qa: -0.0102 0.0052 0.0019 -0.0026 -0.0633 -0.0448 -0.3490 -0.2610 -0.2894 -0.1401 -0.0595 0.0459 0.3525 0.0237 0.0025 0.1912 -0.0398 -0.0046 -0.0793 -0.2035 0.3035 0.0915 -0.0986 -0.1563 0.1562 0.1579 0.1324 0.1221 0.2155
va: 1.3320 1.3461 1.3429 1.3360 1.2855 1.2743 2.1518 2.1914 2.1928 3.2299 3.7394 3.6315 4.0001 4.0153 4.0578 3.8088 4.0835 4.0403 3.9822 4.0179 4.3296 3.9578 3.9708 4.0312 1.0593 1.0368 0.9999 1.0135 1.0321
dispcorr: -0.017581582 hartree
energy: -3578.301551444108
dipole: -20.28436 19.55582 -0.72854 15.82158 -16.01344 -0.19186 4.97700 -5.44289 -0.46589
magnitude: 0.88580 au
magnitude: 2.25152 debye
