program: Orca
programVersion: 5.0.2
elementType: O O O N N N N N N N C C C C C C C C C C C C C C C C C C C C H H H H H H H H H H H H H H H H H H H H H H H
charge: 0
multiplicity: 1
keywords: wb97x-d3
keywords: def2-TZVPP
keywords: def2/J RIJCOSX
keywords: DEFGRID2
keywords: scfconv7
keywords: smallprint printgap noloewdin
keywords: NOSOSCF
formula: C20H23N7O3
InChI: InChI=1/C20H23N7O3/c1-20(2,3)30-19(28)22-16-12-8-11-15(21-16)13-29-24-17(14-9-6-5-7-10-14)18-23-25-26-27(18)4/h5-12,22H,13H2,1-4H3
53 atoms
O  -6.25397 0.482984 -0.101964
O  1.650597 0.101611 -0.449323
O  -5.636405 -1.669078 0.226657
N  -4.126803 -0.014944 -0.225132
N  -1.887915 0.094978 -0.516681
N  3.455625 -0.70675 1.73623
N  2.659367 0.898051 -0.860948
N  4.5121 -1.761334 0.200749
N  3.754481 -1.905515 2.205718
N  4.386473 -2.521256 1.285537
C  -7.691003 0.297893 0.08767
C  -8.239858 1.705015 -0.099871
C  -8.262378 -0.626294 -0.977273
C  -7.99382 -0.189309 1.497144
C  -5.379884 -0.507949 -0.009056
C  -2.913123 -0.690037 -0.212162
C  -0.659958 -0.409184 -0.538102
C  3.794737 0.546767 -0.394801
C  4.984124 1.34064 -0.743064
C  0.404454 0.567361 -0.94184
C  -2.753723 -2.040324 0.101365
C  3.923187 -0.625386 0.488354
C  -0.391906 -1.738069 -0.25022
C  -1.469364 -2.549015 0.075866
C  6.26647 0.881515 -0.44446
C  4.842457 2.579597 -1.37674
C  7.381215 1.636036 -0.783262
C  5.956273 3.329145 -1.708035
C  7.232185 2.859742 -1.415704
C  2.675372 0.235956 2.507972
H  -9.322114 1.694665 0.024433
H  -8.021928 2.089659 -1.097269
H  -7.826968 2.396922 0.63563
H  -9.350966 -0.59817 -0.920233
H  -7.977978 -0.296332 -1.977502
H  -7.956719 -1.662807 -0.852216
H  -9.071222 -0.146447 1.659476
H  -7.523687 0.452371 2.24385
H  -7.6789 -1.215757 1.671992
H  -4.048492 0.971481 -0.432729
H  0.436336 0.648427 -2.033173
H  0.176118 1.555965 -0.536892
H  -3.585482 -2.673053 0.358711
H  0.61088 -2.138648 -0.278287
H  -1.308078 -3.592093 0.313861
H  6.41444 -0.070921 0.044909
H  3.857639 2.964627 -1.602598
H  8.368135 1.260012 -0.548818
H  5.828588 4.287933 -2.192777
H  8.101706 3.448673 -1.675785
H  2.99509 0.192454 3.54433
H  2.845203 1.239632 2.130723
H  1.618046 -0.007043 2.440752
elementType: O N C H
totalener: -1384.99709468 hartree
nucrepener: 2704.60162637 hartree
electener: -4089.59872104 hartree
oneelecener: -7258.38371212 hartree
twoeener: 3168.78499108 hartree
cpcmener: -0.04474033 hartree
kineticenergy: 1379.21266530 hartree
xcener: -132.283142541091 hartree
chargesum: -0.0000000
charge: -0.341467 -0.206477 -0.528065 -0.150415 -0.416594 0.114641 -0.131720 -0.250551 -0.164895 -0.116578 0.278186 -0.283456 -0.313435 -0.315297 0.539684 0.296906 0.167653 0.200094 -0.005093 0.026087 -0.228059 0.132013 -0.192627 -0.115083 -0.190529 -0.190142 -0.165722 -0.155303 -0.143877 -0.135012 0.095332 0.103997 0.103627 0.105119 0.104604 0.101969 0.105027 0.105108 0.102041 0.172893 0.119162 0.107674 0.160964 0.147013 0.161468 0.156008 0.146884 0.162050 0.161602 0.163709 0.136327 0.135027 0.127526
qa: -0.3415 -0.2065 -0.5281 -0.1504 -0.4166 0.1146 -0.1317 -0.2506 -0.1649 -0.1166 0.2782 -0.2835 -0.3134 -0.3153 0.5397 0.2969 0.1677 0.2001 -0.0051 0.0261 -0.2281 0.1320 -0.1926 -0.1151 -0.1905 -0.1901 -0.1657 -0.1553 -0.1439 -0.1350 0.0953 0.1040 0.1036 0.1051 0.1046 0.1020 0.1050 0.1051 0.1020 0.1729 0.1192 0.1077 0.1610 0.1470 0.1615 0.1560 0.1469 0.1621 0.1616 0.1637 0.1363 0.1350 0.1275
va: 2.1132 2.0093 1.9710 3.1772 3.0373 3.3960 2.9430 2.8887 2.8216 2.8461 3.7874 3.9122 3.9071 3.9063 4.2533 4.0468 3.8387 3.8208 3.7489 3.9361 3.9005 4.0691 3.9063 3.9571 3.9317 3.9646 3.9262 3.9128 3.9044 3.8428 1.0060 1.0070 1.0073 1.0027 1.0064 1.0198 1.0028 1.0061 1.0203 1.0355 0.9993 1.0132 1.0246 1.0085 0.9934 1.0142 1.0256 0.9923 0.9919 0.9881 1.0012 0.9915 0.9916
dispcorr: -0.024521656 hartree
energy: -1385.021616331984
dipole: -39.48402 38.00014 -1.48388 10.61506 -7.26956 3.34550 1.53435 -1.11799 0.41636
magnitude: 3.68343 au
magnitude: 9.36253 debye
