program: Orca
programVersion: 5.0.2
elementType: O O O N N N N N N N C C C C C C C C C C C C C C C C C C C C H H H H H H H H H H H H H H H H H H H H H H H
charge: 0
multiplicity: 1
keywords: wb97x-d3
keywords: def2-TZVPP
keywords: def2/J RIJCOSX
keywords: DEFGRID2
keywords: scfconv7
keywords: smallprint printgap noloewdin
keywords: NOSOSCF
formula: C20H23N7O3
InChI: InChI=1/C20H23N7O3/c1-20(2,3)30-19(28)22-16-12-8-11-15(21-16)13-29-24-17(14-9-6-5-7-10-14)18-23-25-26-27(18)4/h5-12,22H,13H2,1-4H3
53 atoms
O  -6.217875 0.315234 -0.484532
O  1.67713 -0.139302 -0.565331
O  -5.616074 -1.502118 0.724022
N  -4.11022 -0.257266 -0.46238
N  -1.866562 -0.217905 -0.703047
N  3.436524 -0.509186 1.787639
N  2.63832 0.687883 -1.028954
N  4.627117 -1.653857 0.423825
N  3.794269 -1.621987 2.404236
N  4.504111 -2.293081 1.584333
C  -7.638325 0.318756 -0.145536
C  -8.158416 1.528619 -0.908171
C  -8.319725 -0.945274 -0.648301
C  -7.836785 0.524579 1.349083
C  -5.356118 -0.567724 -0.003112
C  -2.895863 -0.862639 -0.169777
C  -0.634882 -0.674375 -0.511837
C  3.771383 0.501705 -0.471087
C  4.909554 1.347478 -0.860535
C  0.430986 0.14167 -1.182398
C  -2.739953 -2.01673 0.598591
C  3.949409 -0.539286 0.555779
C  -0.370319 -1.81738 0.225955
C  -1.452404 -2.481158 0.785509
C  6.166035 1.159996 -0.285758
C  4.743212 2.3707 -1.800161
C  7.233204 1.971496 -0.646041
C  5.808518 3.178206 -2.15228
C  7.060159 2.981671 -1.578197
C  2.554323 0.454585 2.409248
H  -7.672606 2.447594 -0.57659
H  -9.228921 1.636905 -0.737946
H  -8.000061 1.422451 -1.982342
H  -8.1062 -1.113465 -1.704937
H  -8.034074 -1.833855 -0.088927
H  -9.398999 -0.827971 -0.545929
H  -7.264067 1.381314 1.707462
H  -7.565128 -0.347764 1.940022
H  -8.890324 0.731898 1.538968
H  -4.027229 0.564896 -1.045028
H  0.472514 -0.102763 -2.249137
H  0.189821 1.202868 -1.090204
H  -3.575955 -2.537576 1.032928
H  0.631039 -2.19716 0.358817
H  -1.29116 -3.37504 1.37334
H  6.331784 0.382418 0.44725
H  3.775801 2.54038 -2.252204
H  8.201674 1.808833 -0.192388
H  5.661689 3.968372 -2.876528
H  7.891586 3.615893 -1.855722
H  2.644039 1.407089 1.896409
H  1.525083 0.107172 2.359801
H  2.847082 0.58557 3.44628
elementType: O N C H
totalener: -1384.99744739 hartree
nucrepener: 2707.87002584 hartree
electener: -4092.86747324 hartree
oneelecener: -7264.80981749 hartree
twoeener: 3171.94234425 hartree
cpcmener: -0.04542824 hartree
kineticenergy: 1379.21253793 hartree
xcener: -132.283042117385 hartree
chargesum: 0.0000000
charge: -0.339994 -0.203008 -0.528072 -0.152039 -0.418098 0.118191 -0.139368 -0.241877 -0.163720 -0.109677 0.272689 -0.282321 -0.311605 -0.313851 0.540933 0.294434 0.182864 0.181748 -0.002830 0.024803 -0.227885 0.119380 -0.208947 -0.107417 -0.182010 -0.181822 -0.175111 -0.158042 -0.138924 -0.136250 0.103917 0.095232 0.103279 0.104520 0.101016 0.105479 0.106098 0.101141 0.105696 0.172877 0.119052 0.104020 0.159813 0.150147 0.161910 0.156969 0.148846 0.162167 0.161297 0.164053 0.134261 0.128900 0.137139
qa: -0.3400 -0.2030 -0.5281 -0.1520 -0.4181 0.1182 -0.1394 -0.2419 -0.1637 -0.1097 0.2727 -0.2823 -0.3116 -0.3139 0.5409 0.2944 0.1829 0.1817 -0.0028 0.0248 -0.2279 0.1194 -0.2089 -0.1074 -0.1820 -0.1818 -0.1751 -0.1580 -0.1389 -0.1362 0.1039 0.0952 0.1033 0.1045 0.1010 0.1055 0.1061 0.1011 0.1057 0.1729 0.1191 0.1040 0.1598 0.1501 0.1619 0.1570 0.1488 0.1622 0.1613 0.1641 0.1343 0.1289 0.1371
va: 2.1116 2.0105 1.9724 3.1748 3.0352 3.4036 2.9539 2.9076 2.8215 2.8423 3.7937 3.9125 3.9068 3.9058 4.2531 4.0488 3.8322 3.8413 3.7629 3.9420 3.9048 4.0620 3.8997 3.9475 3.9389 3.9563 3.9287 3.9129 3.8997 3.8448 1.0069 1.0061 1.0074 1.0064 1.0199 1.0029 1.0060 1.0195 1.0027 1.0358 0.9979 1.0143 1.0245 1.0057 0.9930 1.0022 1.0263 0.9924 0.9921 0.9879 0.9919 0.9890 1.0009
dispcorr: -0.024761824 hartree
energy: -1385.022209218688
dipole: -39.85487 38.17836 -1.67652 11.38660 -8.11292 3.27368 -0.18949 0.01661 -0.17288
magnitude: 3.68206 au
magnitude: 9.35904 debye
