program: Orca
programVersion: 5.0.2
elementType: O O O N N N N N N N C C C C C C C C C C C C C C C C C C C C H H H H H H H H H H H H H H H H H H H H H H H
charge: 0
multiplicity: 1
keywords: wb97x-d3
keywords: def2-TZVPP
keywords: def2/J RIJCOSX
keywords: DEFGRID2
keywords: scfconv7
keywords: smallprint printgap noloewdin
keywords: NOSOSCF
formula: C20H23N7O3
InChI: InChI=1/C20H23N7O3/c1-20(2,3)30-19(28)22-16-12-8-11-15(21-16)13-29-24-17(14-9-6-5-7-10-14)18-23-25-26-27(18)4/h5-12,22H,13H2,1-4H3
53 atoms
O  -5.993799 0.202508 1.63569
O  1.778473 -0.218126 0.255528
O  -5.627945 -1.479888 0.167302
N  -3.924984 -0.322645 1.158309
N  -1.669552 -0.329951 1.02759
N  2.932346 -0.128458 -2.458594
N  2.83199 0.539956 0.627179
N  4.379579 -1.474738 -1.632398
N  3.112839 -1.106665 -3.329097
N  3.978041 -1.898998 -2.828156
C  -7.453627 0.138665 1.637378
C  -7.839148 1.287023 2.558768
C  -8.017977 0.384532 0.245239
C  -7.927378 -1.18244 2.224349
C  -5.23571 -0.61354 0.918762
C  -2.790678 -0.89786 0.601537
C  -0.500117 -0.769543 0.57921
C  3.801763 0.479546 -0.200935
C  5.006401 1.285735 0.049266
C  0.692867 -0.064711 1.156495
C  -2.795179 -1.951181 -0.31328
C  3.716281 -0.366715 -1.404427
C  -0.392585 -1.811998 -0.32836
C  -1.570072 -2.397314 -0.770261
C  6.160025 1.105944 -0.713659
C  5.005921 2.260262 1.052966
C  7.290781 1.873175 -0.470516
C  6.133647 3.025066 1.287273
C  7.282963 2.833787 0.528132
C  1.962532 0.922484 -2.681923
H  -8.923506 1.332087 2.653902
H  -7.499415 2.245982 2.164523
H  -7.421804 1.156225 3.558263
H  -7.857165 -0.448144 -0.435468
H  -9.094887 0.535148 0.326034
H  -7.593584 1.286173 -0.198675
H  -7.714481 -2.033956 1.581322
H  -9.007893 -1.140469 2.362735
H  -7.477355 -1.36298 3.201379
H  -3.730194 0.429961 1.80486
H  0.460962 0.992056 1.302354
H  0.946518 -0.493659 2.131689
H  -3.706187 -2.40862 -0.658984
H  0.564536 -2.16773 -0.680988
H  -1.534497 -3.213896 -1.479306
H  6.19619 0.363386 -1.498765
H  4.116889 2.428508 1.645138
H  8.178193 1.71632 -1.069043
H  6.114368 3.779469 2.062729
H  8.16294 3.435373 0.712824
H  0.966731 0.579385 -2.410286
H  2.227089 1.790348 -2.085145
H  1.978609 1.200617 -3.731591
elementType: O N C H
totalener: -1384.99698098 hartree
nucrepener: 2711.33347717 hartree
electener: -4096.33045815 hartree
oneelecener: -7271.76050884 hartree
twoeener: 3175.43005069 hartree
cpcmener: -0.04482910 hartree
kineticenergy: 1379.20269846 hartree
xcener: -132.281030993295 hartree
chargesum: -0.0000000
charge: -0.340987 -0.202313 -0.527914 -0.150364 -0.415718 0.115109 -0.137814 -0.246075 -0.164533 -0.115047 0.275666 -0.281669 -0.314787 -0.313317 0.539862 0.298082 0.172903 0.198097 -0.005675 0.028526 -0.228165 0.122491 -0.205127 -0.109461 -0.185144 -0.185423 -0.168434 -0.157535 -0.141350 -0.135354 0.095253 0.103405 0.103314 0.101519 0.105202 0.105533 0.101759 0.105594 0.104674 0.172755 0.103864 0.120051 0.160454 0.147693 0.161964 0.155552 0.147259 0.161927 0.161389 0.163275 0.126645 0.135754 0.136638
qa: -0.3410 -0.2023 -0.5279 -0.1504 -0.4157 0.1151 -0.1378 -0.2461 -0.1645 -0.1150 0.2757 -0.2817 -0.3148 -0.3133 0.5399 0.2981 0.1729 0.1981 -0.0057 0.0285 -0.2282 0.1225 -0.2051 -0.1095 -0.1851 -0.1854 -0.1684 -0.1575 -0.1413 -0.1354 0.0953 0.1034 0.1033 0.1015 0.1052 0.1055 0.1018 0.1056 0.1047 0.1728 0.1039 0.1201 0.1605 0.1477 0.1620 0.1556 0.1473 0.1619 0.1614 0.1633 0.1266 0.1358 0.1366
va: 2.1128 2.0111 1.9714 3.1769 3.0396 3.3988 2.9522 2.8994 2.8220 2.8440 3.7914 3.9123 3.9034 3.9104 4.2527 4.0444 3.8514 3.8074 3.7530 3.9303 3.9021 4.0860 3.8976 3.9466 3.9322 3.9619 3.9294 3.9139 3.9036 3.8456 1.0060 1.0070 1.0074 1.0205 1.0030 1.0057 1.0193 1.0026 1.0068 1.0356 1.0159 0.9969 1.0249 1.0079 0.9932 1.0117 1.0258 0.9924 0.9921 0.9884 0.9894 0.9912 1.0012
dispcorr: -0.024790620 hartree
energy: -1385.021771598192
dipole: -38.83601 37.26841 -1.56760 10.04546 -6.91229 3.13317 9.93515 -8.82703 1.10812
magnitude: 3.67451 au
magnitude: 9.33986 debye
