program: Orca
programVersion: 5.0.2
elementType: O O O N N N N N N N C C C C C C C C C C C C C C C C C C C C H H H H H H H H H H H H H H H H H H H H H H H
charge: 0
multiplicity: 1
keywords: wb97x-d3
keywords: def2-TZVPP
keywords: def2/J RIJCOSX
keywords: DEFGRID2
keywords: scfconv7
keywords: smallprint printgap noloewdin
keywords: NOSOSCF
formula: C20H23N7O3
InChI: InChI=1/C20H23N7O3/c1-20(2,3)30-19(28)22-16-12-8-11-15(21-16)13-29-24-17(14-9-6-5-7-10-14)18-23-25-26-27(18)4/h5-12,22H,13H2,1-4H3
53 atoms
O  -5.156968 0.517978 1.801866
O  2.014028 -1.939661 0.212693
O  -5.063532 0.326336 -0.451857
N  -3.39127 -0.416626 0.916454
N  -1.383464 -1.411485 0.639621
N  4.329995 -1.546596 -1.65276
N  2.019739 -0.589954 0.314224
N  5.360545 -1.110428 0.173499
N  5.488055 -2.183532 -1.683799
N  6.09396 -1.911662 -0.595365
C  -6.471996 1.148422 1.885208
C  -6.657882 1.342035 3.383123
C  -6.468979 2.499649 1.185298
C  -7.550939 0.21987 1.347321
C  -4.5955 0.165469 0.655177
C  -2.452872 -0.917848 0.024171
C  -0.396038 -1.92575 -0.079342
C  3.119354 -0.059205 -0.053983
C  3.238295 1.407246 -0.042535
C  0.779399 -2.460613 0.689664
C  -2.578671 -0.909224 -1.363825
C  4.254558 -0.888135 -0.49441
C  -0.426589 -1.974902 -1.465432
C  -1.540186 -1.451687 -2.100768
C  4.475279 2.02927 -0.207417
C  2.099028 2.201106 0.126323
C  4.574087 3.413985 -0.188751
C  2.203008 3.579944 0.140022
C  3.441824 4.19354 -0.014629
C  3.358929 -1.680211 -2.718364
H  -7.623531 1.808592 3.575074
H  -5.885919 1.989726 3.801531
H  -6.636057 0.389747 3.91491
H  -6.402957 2.419225 0.102301
H  -7.399367 3.019231 1.418032
H  -5.647525 3.124135 1.539719
H  -7.49386 -0.762594 1.818488
H  -7.505609 0.091325 0.267739
H  -8.52858 0.641261 1.584782
H  -3.119639 -0.498845 1.886937
H  0.660085 -2.250753 1.754362
H  0.870977 -3.539796 0.561289
H  -3.442033 -0.501264 -1.860977
H  0.387733 -2.40985 -2.029394
H  -1.608657 -1.465079 -3.180466
H  5.375893 1.44642 -0.343388
H  1.126887 1.739773 0.236319
H  5.54267 3.880016 -0.313364
H  1.311554 4.179887 0.26556
H  3.519669 5.272857 -0.005003
H  3.875377 -1.65989 -3.673071
H  2.817834 -2.617428 -2.615697
H  2.662247 -0.848441 -2.678314
elementType: O N C H
totalener: -1384.99734236 hartree
nucrepener: 2778.92893620 hartree
electener: -4163.92627856 hartree
oneelecener: -7407.06771677 hartree
twoeener: 3243.14143820 hartree
cpcmener: -0.04928508 hartree
kineticenergy: 1379.21683573 hartree
xcener: -132.281510423076 hartree
chargesum: -0.0000000
charge: -0.341861 -0.214700 -0.529134 -0.152206 -0.393263 0.101944 -0.121298 -0.248120 -0.162452 -0.116215 0.278142 -0.282227 -0.315785 -0.314845 0.539350 0.300789 0.120625 0.175856 0.015415 0.062554 -0.220898 0.134539 -0.213248 -0.120408 -0.188453 -0.193849 -0.163982 -0.152975 -0.146202 -0.150571 0.095227 0.103481 0.103548 0.102255 0.105212 0.105246 0.105033 0.101623 0.105549 0.172697 0.103974 0.119384 0.159672 0.161282 0.162267 0.156255 0.150167 0.161598 0.161278 0.163406 0.141291 0.138386 0.134647
qa: -0.3419 -0.2147 -0.5291 -0.1522 -0.3933 0.1019 -0.1213 -0.2481 -0.1625 -0.1162 0.2781 -0.2822 -0.3158 -0.3148 0.5394 0.3008 0.1206 0.1759 0.0154 0.0626 -0.2209 0.1345 -0.2132 -0.1204 -0.1885 -0.1938 -0.1640 -0.1530 -0.1462 -0.1506 0.0952 0.1035 0.1035 0.1023 0.1052 0.1052 0.1050 0.1016 0.1055 0.1727 0.1040 0.1194 0.1597 0.1613 0.1623 0.1563 0.1502 0.1616 0.1613 0.1634 0.1413 0.1384 0.1346
va: 2.1127 1.9832 1.9705 3.1808 3.0175 3.3961 2.9380 2.9078 2.8206 2.8471 3.7872 3.9128 3.9064 3.9073 4.2547 4.0237 3.8709 3.8580 3.6934 3.8340 3.9017 4.1085 3.8783 3.9711 3.9360 3.9707 3.9231 3.9108 3.9032 3.8363 1.0060 1.0072 1.0072 1.0201 1.0026 1.0061 1.0062 1.0201 1.0024 1.0361 1.0250 0.9939 1.0254 0.9956 0.9940 1.0103 1.0172 0.9923 0.9917 0.9882 1.0011 0.9899 0.9916
dispcorr: -0.025533907 hartree
energy: -1385.022876270138
dipole: -40.14358 37.25643 -2.88715 13.24379 -12.28133 0.96246 4.97335 -5.93178 -0.95842
magnitude: 3.19070 au
magnitude: 8.11011 debye
