program: Orca
programVersion: 5.0.2
elementType: O O O N N N N N N N C C C C C C C C C C C C C C C C C C C C H H H H H H H H H H H H H H H H H H H H H H H
charge: 0
multiplicity: 1
keywords: wb97x-d3
keywords: def2-TZVPP
keywords: def2/J RIJCOSX
keywords: DEFGRID2
keywords: scfconv7
keywords: smallprint printgap noloewdin
keywords: NOSOSCF
formula: C20H23N7O3
InChI: InChI=1/C20H23N7O3/c1-20(2,3)30-19(28)22-16-12-8-11-15(21-16)13-29-24-17(14-9-6-5-7-10-14)18-23-25-26-27(18)4/h5-12,22H,13H2,1-4H3
53 atoms
O  -5.616426 0.67374 0.349949
O  1.661778 -1.528665 -1.574738
O  -4.574281 0.059103 2.262907
N  -3.651069 -0.274511 0.200023
N  -1.68312 -1.065121 -0.582041
N  4.543181 -1.872547 -0.761139
N  1.816284 -0.260263 -1.126999
N  4.884386 -0.669755 -2.499837
N  5.544266 -2.414153 -1.433355
N  5.738703 -1.689546 -2.464065
C  -6.822646 1.231035 0.957728
C  -7.635716 1.669983 -0.251583
C  -7.583671 0.164623 1.732045
C  -6.484109 2.43761 1.82032
C  -4.624255 0.150748 1.054932
C  -2.435229 -0.876819 0.497612
C  -0.497691 -1.645182 -0.458587
C  3.035226 0.099161 -1.024415
C  3.327364 1.427959 -0.46276
C  0.281187 -1.824859 -1.732586
C  -2.018918 -1.253861 1.772991
C  4.135395 -0.79259 -1.430518
C  0.00155 -2.075137 0.76235
C  -0.780783 -1.862161 1.884731
C  4.555526 2.051327 -0.67899
C  2.362027 2.080294 0.310575
C  4.806707 3.307586 -0.145177
C  2.619014 3.331188 0.841887
C  3.842081 3.951543 0.614554
C  4.014292 -2.479368 0.441317
H  -7.878212 0.825208 -0.89798
H  -7.102998 2.41652 -0.842518
H  -8.572986 2.115393 0.079938
H  -7.743267 -0.725661 1.12199
H  -7.087729 -0.129135 2.654485
H  -8.564428 0.558701 2.000028
H  -5.892184 3.165548 1.263571
H  -5.947417 2.174048 2.729403
H  -7.411155 2.928076 2.118914
H  -3.798154 -0.108884 -0.786395
H  0.259808 -2.8669 -2.05573
H  -0.154674 -1.214786 -2.526452
H  -2.624212 -1.08864 2.64762
H  0.965873 -2.558826 0.83887
H  -0.429557 -2.172902 2.859791
H  5.321183 1.573005 -1.274362
H  1.413762 1.60039 0.511118
H  5.762057 3.781543 -0.32659
H  1.865678 3.819459 1.445696
H  4.043018 4.927695 1.035811
H  4.837116 -2.881355 1.023998
H  3.502802 -1.724159 1.029861
H  3.322748 -3.278321 0.186286
elementType: O N C H
totalener: -1384.99690023 hartree
nucrepener: 2769.69069673 hartree
electener: -4154.68759695 hartree
oneelecener: -7388.56414165 hartree
twoeener: 3233.87654469 hartree
cpcmener: -0.04904613 hartree
kineticenergy: 1379.21573455 hartree
xcener: -132.281674768410 hartree
chargesum: -0.0000000
charge: -0.340664 -0.216088 -0.529102 -0.152778 -0.394046 0.099018 -0.120511 -0.248100 -0.162166 -0.118373 0.274928 -0.281892 -0.314998 -0.313312 0.539499 0.305471 0.129978 0.178018 0.021943 0.063936 -0.227230 0.136574 -0.224731 -0.114531 -0.186643 -0.198130 -0.163095 -0.155617 -0.144964 -0.147177 0.102942 0.103286 0.095695 0.105306 0.101454 0.105350 0.104468 0.102200 0.105905 0.172983 0.117153 0.105374 0.159593 0.161544 0.161332 0.154930 0.147066 0.161627 0.161705 0.163566 0.141376 0.134423 0.135506
qa: -0.3407 -0.2161 -0.5291 -0.1528 -0.3940 0.0990 -0.1205 -0.2481 -0.1622 -0.1184 0.2749 -0.2819 -0.3150 -0.3133 0.5395 0.3055 0.1300 0.1780 0.0219 0.0639 -0.2272 0.1366 -0.2247 -0.1145 -0.1866 -0.1981 -0.1631 -0.1556 -0.1450 -0.1472 0.1029 0.1033 0.0957 0.1053 0.1015 0.1054 0.1045 0.1022 0.1059 0.1730 0.1172 0.1054 0.1596 0.1615 0.1613 0.1549 0.1471 0.1616 0.1617 0.1636 0.1414 0.1344 0.1355
va: 2.1124 1.9875 1.9702 3.1833 3.0370 3.3961 2.9305 2.9102 2.8238 2.8508 3.7906 3.9123 3.9056 3.9072 4.2537 4.0235 3.8781 3.8573 3.6631 3.8364 3.9080 4.1153 3.8855 3.9692 3.9316 3.9793 3.9225 3.9171 3.9018 3.8384 1.0073 1.0073 1.0060 1.0061 1.0201 1.0029 1.0065 1.0197 1.0026 1.0357 0.9933 1.0246 1.0251 0.9965 0.9943 1.0172 1.0141 0.9924 0.9915 0.9881 1.0012 0.9908 0.9895
dispcorr: -0.025556266 hartree
energy: -1385.022456493552
dipole: -38.88859 36.63855 -2.25004 10.80251 -10.60110 0.20141 14.50616 -12.27577 2.23039
magnitude: 3.17457 au
magnitude: 8.06911 debye
