program: Orca
programVersion: 5.0.2
elementType: O O O N N N N N N N C C C C C C C C C C C C C C C C C C C C H H H H H H H H H H H H H H H H H H H H H H H
charge: 0
multiplicity: 1
keywords: wb97x-d3
keywords: def2-TZVPP
keywords: def2/J RIJCOSX
keywords: DEFGRID2
keywords: scfconv7
keywords: smallprint printgap noloewdin
keywords: NOSOSCF
formula: C20H23N7O3
InChI: InChI=1/C20H23N7O3/c1-20(2,3)30-19(28)22-16-12-8-11-15(21-16)13-29-24-17(14-9-6-5-7-10-14)18-23-25-26-27(18)4/h5-12,22H,13H2,1-4H3
53 atoms
O  -6.212904 0.398141 0.571654
O  1.478991 0.139111 -1.615804
O  -5.099634 -0.829514 2.111896
N  -4.045695 0.200016 0.363661
N  -1.931694 0.290136 -0.431575
N  4.071648 -1.161389 -2.495694
N  2.26952 0.894724 -0.811642
N  3.765037 -2.08469 -0.587879
N  4.273857 -2.459669 -2.64259
N  4.089913 -2.997649 -1.501069
C  -7.555003 0.223221 1.123077
C  -7.957339 -1.244658 1.126072
C  -7.655824 0.849732 2.50607
C  -8.423418 0.993113 0.138842
C  -5.132639 -0.14389 1.1127
C  -2.725463 -0.20477 0.508338
C  -0.64479 -0.038585 -0.444124
C  3.422837 0.376494 -0.637598
C  4.43572 1.086588 0.154827
C  0.132322 0.566868 -1.581036
C  -2.256622 -1.052198 1.513315
C  3.750382 -0.937085 -1.221435
C  -0.081618 -0.88682 0.494801
C  -0.916409 -1.383654 1.485947
C  4.145149 2.313439 0.760809
C  5.7153 0.549943 0.297354
C  5.114062 2.978633 1.489579
C  6.683442 1.221738 1.030286
C  6.387717 2.436234 1.628325
C  4.134373 -0.242028 -3.6107
H  -9.02469 -1.314909 1.338564
H  -7.436888 -1.830201 1.880768
H  -7.787482 -1.701836 0.150009
H  -8.701514 0.85675 2.815248
H  -7.096481 0.303174 3.262483
H  -7.309227 1.884047 2.494932
H  -8.141525 2.046096 0.095162
H  -9.465832 0.940025 0.451141
H  -8.355028 0.574589 -0.866514
H  -4.209248 0.789527 -0.441508
H  -0.301743 0.245922 -2.52987
H  0.075723 1.658581 -1.544912
H  -2.899506 -1.444587 2.282227
H  0.961156 -1.167076 0.470881
H  -0.518976 -2.043638 2.245739
H  3.161315 2.751278 0.659803
H  5.976352 -0.394749 -0.161661
H  4.876091 3.927238 1.952877
H  7.671035 0.79073 1.128767
H  7.142431 2.95991 2.199944
H  4.306234 0.762995 -3.237118
H  4.959911 -0.522885 -4.257258
H  3.203853 -0.26832 -4.172376
elementType: O N C H
totalener: -1384.99856911 hartree
nucrepener: 2723.14081974 hartree
electener: -4108.13938885 hartree
oneelecener: -7296.05031509 hartree
twoeener: 3187.91092625 hartree
cpcmener: -0.04686186 hartree
kineticenergy: 1379.19571003 hartree
xcener: -132.279154056946 hartree
chargesum: -0.0000000
charge: -0.340430 -0.214314 -0.527864 -0.152773 -0.427534 0.118122 -0.131530 -0.240335 -0.166166 -0.111272 0.273606 -0.314655 -0.312177 -0.281343 0.540592 0.293558 0.174667 0.156692 0.005954 0.041334 -0.227972 0.120761 -0.184276 -0.123285 -0.180584 -0.170594 -0.161226 -0.183468 -0.132464 -0.128623 0.105439 0.101479 0.105741 0.105531 0.101694 0.104302 0.102946 0.095268 0.103597 0.172810 0.120315 0.112979 0.159496 0.137326 0.161022 0.147565 0.162134 0.162134 0.161151 0.163784 0.132664 0.134611 0.133612
qa: -0.3404 -0.2143 -0.5279 -0.1528 -0.4275 0.1181 -0.1315 -0.2403 -0.1662 -0.1113 0.2736 -0.3147 -0.3122 -0.2813 0.5406 0.2936 0.1747 0.1567 0.0060 0.0413 -0.2280 0.1208 -0.1843 -0.1233 -0.1806 -0.1706 -0.1612 -0.1835 -0.1325 -0.1286 0.1054 0.1015 0.1057 0.1055 0.1017 0.1043 0.1029 0.0953 0.1036 0.1728 0.1203 0.1130 0.1595 0.1373 0.1610 0.1476 0.1621 0.1621 0.1612 0.1638 0.1327 0.1346 0.1336
va: 2.1126 1.9841 1.9720 3.1826 3.0367 3.4021 2.9025 2.8791 2.8186 2.8524 3.7924 3.9047 3.9085 3.9124 4.2520 4.0556 3.7570 3.8904 3.7479 3.9214 3.8964 4.0199 3.8923 3.9898 3.9629 3.9288 3.9155 3.9257 3.8923 3.8327 1.0028 1.0199 1.0059 1.0027 1.0196 1.0065 1.0076 1.0060 1.0071 1.0359 0.9987 1.0162 1.0251 1.0102 0.9942 1.0252 0.9908 0.9917 0.9932 0.9879 0.9935 0.9994 0.9933
dispcorr: -0.024814384 hartree
energy: -1385.023383494949
dipole: -35.80741 35.46115 -0.34626 9.55805 -6.49796 3.06009 5.57185 -6.99580 -1.42395
magnitude: 3.39288 au
magnitude: 8.62402 debye
