program: Orca
programVersion: 5.0.2
elementType: O O O N N N N N N N C C C C C C C C C C C C C C C C C C C C H H H H H H H H H H H H H H H H H H H H H H H
charge: 0
multiplicity: 1
keywords: wb97x-d3
keywords: def2-TZVPP
keywords: def2/J RIJCOSX
keywords: DEFGRID2
keywords: scfconv7
keywords: smallprint printgap noloewdin
keywords: NOSOSCF
formula: C20H23N7O3
InChI: InChI=1/C20H23N7O3/c1-20(2,3)30-19(28)22-16-12-8-11-15(21-16)13-29-24-17(14-9-6-5-7-10-14)18-23-25-26-27(18)4/h5-12,22H,13H2,1-4H3
53 atoms
O  -5.6711 0.809166 0.269074
O  1.666628 -1.313524 -1.649659
O  -4.740271 -0.129277 2.106205
N  -3.715099 -0.145515 0.06364
N  -1.725569 -0.845509 -0.749305
N  4.632201 -1.549032 -1.804209
N  1.904533 -0.081194 -1.135585
N  4.526296 -1.698476 0.329673
N  5.444162 -2.521975 -1.430227
N  5.371841 -2.601312 -0.158894
C  -6.90939 1.269138 0.893337
C  -7.71943 0.095728 1.425305
C  -6.619911 2.305294 1.969484
C  -7.646751 1.922649 -0.266277
C  -4.724914 0.157903 0.928317
C  -2.509394 -0.784339 0.322346
C  -0.536735 -1.423875 -0.654165
C  3.084509 0.053787 -0.671756
C  3.462137 1.331545 -0.05146
C  0.281161 -1.460873 -1.915964
C  -2.12846 -1.30439 1.558252
C  4.061526 -1.045927 -0.708243
C  -0.063697 -1.976769 0.527065
C  -0.884964 -1.905747 1.639945
C  2.480647 2.239537 0.355326
C  4.805431 1.657506 0.130229
C  2.840984 3.448112 0.923477
C  5.161313 2.871073 0.70112
C  4.182738 3.768934 1.098926
C  4.436801 -1.204413 -3.195988
H  -7.84914 -0.671871 0.660914
H  -8.711617 0.452005 1.704099
H  -7.279477 -0.363063 2.308332
H  -6.1349 1.885289 2.848206
H  -5.997532 3.112339 1.580273
H  -7.562463 2.746086 2.295758
H  -7.853222 1.206771 -1.063112
H  -7.075496 2.752269 -0.685328
H  -8.600151 2.317765 0.082628
H  -3.821377 0.160482 -0.894143
H  0.191787 -2.43277 -2.404625
H  -0.064351 -0.696675 -2.615404
H  -2.762694 -1.247567 2.426002
H  0.910066 -2.443889 0.582037
H  -0.558093 -2.320938 2.584092
H  1.433479 1.996144 0.2363
H  5.586819 0.975716 -0.179632
H  2.071557 4.140479 1.238157
H  6.207618 3.111738 0.834232
H  4.461081 4.713118 1.548092
H  3.676472 -1.840944 -3.641152
H  4.133604 -0.164091 -3.269247
H  5.37608 -1.333959 -3.724333
elementType: O N C H
totalener: -1384.99881991 hartree
nucrepener: 2761.90565937 hartree
electener: -4146.90447928 hartree
oneelecener: -7373.62133060 hartree
twoeener: 3226.71685132 hartree
cpcmener: -0.04796866 hartree
kineticenergy: 1379.21842032 hartree
xcener: -132.281807467488 hartree
chargesum: 0.0000000
charge: -0.340189 -0.216032 -0.529420 -0.153336 -0.399835 0.117479 -0.132891 -0.233329 -0.164795 -0.114981 0.275836 -0.313652 -0.312598 -0.282668 0.540671 0.305892 0.149329 0.167853 -0.000362 0.064352 -0.231355 0.124993 -0.226322 -0.109185 -0.191375 -0.177025 -0.160807 -0.181155 -0.130562 -0.133639 0.105057 0.105269 0.101246 0.100686 0.104671 0.105359 0.103431 0.103176 0.095218 0.172937 0.118075 0.103938 0.159858 0.145651 0.162462 0.147547 0.164644 0.162069 0.161153 0.164232 0.131236 0.136923 0.134270
qa: -0.3402 -0.2160 -0.5294 -0.1533 -0.3998 0.1175 -0.1329 -0.2333 -0.1648 -0.1150 0.2758 -0.3137 -0.3126 -0.2827 0.5407 0.3059 0.1493 0.1679 -0.0004 0.0644 -0.2314 0.1250 -0.2263 -0.1092 -0.1914 -0.1770 -0.1608 -0.1812 -0.1306 -0.1336 0.1051 0.1053 0.1012 0.1007 0.1047 0.1054 0.1034 0.1032 0.0952 0.1729 0.1181 0.1039 0.1599 0.1457 0.1625 0.1475 0.1646 0.1621 0.1612 0.1642 0.1312 0.1369 0.1343
va: 2.1127 1.9789 1.9701 3.1815 3.0303 3.3874 2.9138 2.9249 2.8199 2.8528 3.7914 3.9057 3.9076 3.9128 4.2522 4.0268 3.8367 3.9336 3.6901 3.8462 3.9052 4.0410 3.9061 3.9556 3.9717 3.9379 3.9224 3.9169 3.8883 3.8324 1.0062 1.0027 1.0199 1.0204 1.0063 1.0027 1.0072 1.0075 1.0060 1.0358 0.9939 1.0263 1.0255 1.0083 0.9930 1.0196 0.9882 0.9918 0.9931 0.9876 0.9940 0.9919 1.0010
dispcorr: -0.025117994 hartree
energy: -1385.023937903822
dipole: -37.26571 35.75622 -1.50949 15.31446 -13.23350 2.08096 1.97625 -4.36993 -2.39369
magnitude: 3.51265 au
magnitude: 8.92844 debye
