program: Orca
programVersion: 5.0.2
elementType: O O O N N N N N N N C C C C C C C C C C C C C C C C C C C C H H H H H H H H H H H H H H H H H H H H H H H
charge: 0
multiplicity: 1
keywords: wb97x-d3
keywords: def2-TZVPP
keywords: def2/J RIJCOSX
keywords: DEFGRID2
keywords: scfconv7
keywords: smallprint printgap noloewdin
keywords: NOSOSCF
formula: C20H23N7O3
InChI: InChI=1/C20H23N7O3/c1-20(2,3)30-19(28)22-16-12-8-11-15(21-16)13-29-24-17(14-9-6-5-7-10-14)18-23-25-26-27(18)4/h5-12,22H,13H2,1-4H3
53 atoms
O  -5.264739 -0.54902 0.274342
O  1.780699 -1.423782 -1.243374
O  -4.280086 -0.171733 2.274138
N  -3.142222 -1.036143 0.492472
N  -1.027319 -1.74115 0.1149
N  1.527288 1.301996 -2.288007
N  2.735656 -0.91773 -0.434864
N  3.460342 1.041667 -3.170172
N  1.483254 1.802897 -3.509993
N  2.638016 1.641862 -4.024669
C  -6.608976 -0.119212 0.648178
C  -7.175563 -1.011912 1.743774
C  -6.622336 1.351317 1.040759
C  -7.394861 -0.31904 -0.639502
C  -4.249139 -0.545605 1.123997
C  -1.879198 -1.272054 1.01681
C  0.211449 -2.051683 0.480774
C  3.234313 0.180732 -0.845864
C  4.299595 0.802558 -0.036982
C  1.128648 -2.52477 -0.61037
C  -1.51583 -1.065055 2.350594
C  2.759635 0.826986 -2.082667
C  0.661555 -1.906426 1.782974
C  -0.226168 -1.395322 2.718851
C  5.120507 1.802209 -0.557016
C  4.501472 0.383131 1.282227
C  6.128517 2.358398 0.21882
C  5.504112 0.9440 2.051609
C  6.325028 1.933452 1.523072
C  0.360668 1.309396 -1.43294
H  -7.092545 -2.066666 1.475531
H  -8.236052 -0.789261 1.870226
H  -6.694874 -0.860828 2.70831
H  -6.139291 1.54174 1.996998
H  -6.140806 1.967012 0.278814
H  -7.65715 1.686264 1.125272
H  -8.433795 -0.027535 -0.48683
H  -7.385928 -1.363348 -0.956352
H  -6.994624 0.289971 -1.451844
H  -3.237122 -1.294308 -0.480895
H  1.872952 -3.227652 -0.230062
H  0.560315 -3.008144 -1.403846
H  -2.206896 -0.672348 3.077005
H  1.670206 -2.182739 2.05675
H  0.084505 -1.255755 3.746128
H  4.996785 2.146039 -1.574725
H  3.865283 -0.378542 1.712054
H  6.760763 3.127951 -0.20434
H  5.642156 0.611267 3.07225
H  7.10858 2.371208 2.127871
H  -0.28395 0.465417 -1.664182
H  0.669861 1.260702 -0.393103
H  -0.180778 2.236455 -1.594724
elementType: O N C H
totalener: -1384.99920796 hartree
nucrepener: 2807.56373157 hartree
electener: -4192.56293952 hartree
oneelecener: -7463.95930842 hartree
twoeener: 3271.39636889 hartree
cpcmener: -0.03788606 hartree
kineticenergy: 1379.22459963 hartree
xcener: -132.281631425220 hartree
chargesum: -0.0000000
charge: -0.336932 -0.211283 -0.500847 -0.153561 -0.394044 0.098847 -0.110771 -0.248488 -0.159033 -0.119650 0.271758 -0.314702 -0.313782 -0.278648 0.523852 0.299023 0.088075 0.166439 0.023856 0.040808 -0.206631 0.154690 -0.158759 -0.128070 -0.202557 -0.199175 -0.152866 -0.150362 -0.148233 -0.151635 0.103693 0.103146 0.104079 0.104608 0.103734 0.103566 0.093445 0.102297 0.102666 0.171302 0.116132 0.111392 0.159899 0.151044 0.160539 0.155448 0.149278 0.159008 0.156938 0.159896 0.129269 0.131968 0.139332
qa: -0.3369 -0.2113 -0.5008 -0.1536 -0.3940 0.0988 -0.1108 -0.2485 -0.1590 -0.1196 0.2718 -0.3147 -0.3138 -0.2786 0.5239 0.2990 0.0881 0.1664 0.0239 0.0408 -0.2066 0.1547 -0.1588 -0.1281 -0.2026 -0.1992 -0.1529 -0.1504 -0.1482 -0.1516 0.1037 0.1031 0.1041 0.1046 0.1037 0.1036 0.0934 0.1023 0.1027 0.1713 0.1161 0.1114 0.1599 0.1510 0.1605 0.1554 0.1493 0.1590 0.1569 0.1599 0.1293 0.1320 0.1393
va: 2.1141 1.9892 2.0031 3.1854 2.9969 3.3947 2.9172 2.9084 2.8158 2.8534 3.8030 3.9065 3.9049 3.9123 4.2701 4.0046 3.8221 3.8978 3.6919 3.8857 3.9154 4.0867 3.8607 3.9803 3.9479 3.9815 3.9271 3.9204 3.9142 3.8401 1.0066 1.0033 1.0198 1.0197 1.0063 1.0033 1.0067 1.0076 1.0076 1.0366 1.0080 1.0140 1.0255 1.0011 0.9934 1.0236 1.0124 0.9931 0.9932 0.9895 1.0030 0.9907 1.0033
dispcorr: -0.026333827 hartree
energy: -1385.025541786046
dipole: -35.22778 33.36259 -1.86519 0.95680 -1.57238 -0.61558 13.96208 -11.36071 2.60136
magnitude: 3.25959 au
magnitude: 8.28523 debye
