program: Orca
programVersion: 5.0.2
elementType: O O O N N N N N N N C C C C C C C C C C C C C C C C C C C C H H H H H H H H H H H H H H H H H H H H H H H
charge: 0
multiplicity: 1
keywords: wb97x-d3
keywords: def2-TZVPP
keywords: def2/J RIJCOSX
keywords: DEFGRID2
keywords: scfconv7
keywords: smallprint printgap noloewdin
keywords: NOSOSCF
formula: C20H23N7O3
InChI: InChI=1/C20H23N7O3/c1-20(2,3)30-19(28)22-16-12-8-11-15(21-16)13-29-24-17(14-9-6-5-7-10-14)18-23-25-26-27(18)4/h5-12,22H,13H2,1-4H3
53 atoms
O  -4.620717 0.105688 0.156712
O  1.923896 -1.601365 1.200825
O  -4.178628 -0.645642 -1.931309
N  -2.762623 -0.99485 -0.171876
N  -0.742271 -1.961677 0.11488
N  1.602902 1.136438 2.328963
N  2.582171 -0.980044 0.199243
N  3.695586 0.99209 2.759367
N  1.794727 1.599088 3.551741
N  3.042568 1.508977 3.796208
C  -5.916435 0.714743 -0.123793
C  -6.91942 -0.331981 -0.588035
C  -6.329897 1.261351 1.235313
C  -5.773327 1.85557 -1.12026
C  -3.897307 -0.51586 -0.761747
C  -1.722752 -1.715626 -0.740963
C  0.326019 -2.640957 -0.287059
C  3.015593 0.178009 0.505643
C  3.73581 0.948986 -0.523433
C  1.401887 -2.84389 0.741625
C  -1.688279 -2.162484 -2.06602
C  2.787851 0.755004 1.843549
C  0.461069 -3.120811 -1.577568
C  -0.575385 -2.874029 -2.468567
C  3.687607 0.538041 -1.859493
C  4.465662 2.091092 -0.196995
C  4.355506 1.250876 -2.83763
C  5.137787 2.800603 -1.183084
C  5.086048 2.385924 -2.504049
C  0.279835 1.067718 1.747856
H  -6.712489 -0.70691 -1.588329
H  -7.914477 0.114192 -0.606938
H  -6.953263 -1.17827 0.100359
H  -7.301896 1.748057 1.157694
H  -6.414125 0.46613 1.977965
H  -5.6165 2.000532 1.603917
H  -6.713011 2.407369 -1.166473
H  -5.54596 1.514282 -2.12831
H  -4.997632 2.556755 -0.807227
H  -2.631061 -0.794892 0.810847
H  0.997039 -3.320371 1.635084
H  2.206167 -3.471465 0.350992
H  -2.491306 -1.968283 -2.756858
H  1.346327 -3.664328 -1.878335
H  -0.515357 -3.232545 -3.488016
H  3.114806 -0.337103 -2.13592
H  4.532112 2.433141 0.827018
H  4.300451 0.922476 -3.867399
H  5.704359 3.681483 -0.91064
H  5.606615 2.94348 -3.271759
H  -0.228265 0.162548 2.072732
H  -0.284762 1.940473 2.065308
H  0.358853 1.073661 0.66396
elementType: O N C H
totalener: -1385.00027435 hartree
nucrepener: 2839.96080971 hartree
electener: -4224.96108406 hartree
oneelecener: -7528.95336670 hartree
twoeener: 3303.99228264 hartree
cpcmener: -0.03929682 hartree
kineticenergy: 1379.22031226 hartree
xcener: -132.281160494744 hartree
chargesum: -0.0000000
charge: -0.336071 -0.204476 -0.500390 -0.155162 -0.407246 0.099687 -0.115491 -0.247020 -0.160594 -0.116068 0.270054 -0.315098 -0.278827 -0.312043 0.522249 0.306218 0.124421 0.160307 0.018342 0.034646 -0.226141 0.150505 -0.189740 -0.106783 -0.193884 -0.192778 -0.149886 -0.155885 -0.145780 -0.145302 0.104625 0.103669 0.104099 0.093746 0.102670 0.102233 0.103471 0.104152 0.102816 0.176513 0.115946 0.113023 0.159361 0.149662 0.160363 0.147753 0.153571 0.157374 0.158573 0.159421 0.124296 0.138246 0.132654
qa: -0.3361 -0.2045 -0.5004 -0.1552 -0.4072 0.0997 -0.1155 -0.2470 -0.1606 -0.1161 0.2701 -0.3151 -0.2788 -0.3120 0.5222 0.3062 0.1244 0.1603 0.0183 0.0346 -0.2261 0.1505 -0.1897 -0.1068 -0.1939 -0.1928 -0.1499 -0.1559 -0.1458 -0.1453 0.1046 0.1037 0.1041 0.0937 0.1027 0.1022 0.1035 0.1042 0.1028 0.1765 0.1159 0.1130 0.1594 0.1497 0.1604 0.1478 0.1536 0.1574 0.1586 0.1594 0.1243 0.1382 0.1327
va: 2.1127 1.9898 2.0058 3.1802 3.0107 3.3885 2.9265 2.9082 2.8181 2.8512 3.8053 3.9053 3.9122 3.9059 4.2731 4.0085 3.8190 3.8829 3.6967 3.9283 3.9270 4.1010 3.8885 3.9504 3.9788 3.9447 3.9169 3.9246 3.9117 3.8314 1.0196 1.0032 1.0063 1.0065 1.0076 1.0075 1.0032 1.0197 1.0068 1.0308 1.0024 1.0047 1.0258 0.9948 0.9922 1.0178 1.0179 0.9930 0.9933 0.9896 1.0080 1.0029 0.9912
dispcorr: -0.026237863 hartree
energy: -1385.026512215758
dipole: -34.26756 32.00175 -2.26581 5.73308 -6.14925 -0.41617 -10.69799 8.55776 -2.14023
magnitude: 3.14447 au
magnitude: 7.99261 debye
