program: Orca
programVersion: 5.0.2
elementType: O O O N N N N N N N C C C C C C C C C C C C C C C C C C C C H H H H H H H H H H H H H H H H H H H H H H H
charge: 0
multiplicity: 1
keywords: wb97x-d3
keywords: def2-TZVPP
keywords: def2/J RIJCOSX
keywords: DEFGRID2
keywords: scfconv7
keywords: smallprint printgap noloewdin
keywords: NOSOSCF
formula: C20H23N7O3
InChI: InChI=1/C20H23N7O3/c1-20(2,3)30-19(28)22-16-12-8-11-15(21-16)13-29-24-17(14-9-6-5-7-10-14)18-23-25-26-27(18)4/h5-12,22H,13H2,1-4H3
53 atoms
O  -4.452042 0.32608 0.029806
O  1.882675 -1.488502 1.388324
O  -4.122786 -0.919026 -1.828021
N  -2.694209 -0.976299 -0.048079
N  -0.712726 -1.971546 0.385417
N  3.067784 0.824801 2.789708
N  2.372299 -0.924949 0.262699
N  1.551241 2.003957 1.844206
N  2.590647 1.663672 3.692021
N  1.689057 2.358891 3.117604
C  -5.670388 0.994852 -0.415991
C  -5.383496 1.880915 -1.619725
C  -6.77727 -0.013369 -0.693245
C  -6.043502 1.853916 0.783659
C  -3.801508 -0.548367 -0.722044
C  -1.721703 -1.872803 -0.467082
C  0.299809 -2.78407 0.107692
C  2.635698 0.315986 0.37855
C  3.155422 1.037649 -0.795506
C  1.422165 -2.803825 1.106539
C  -1.776813 -2.615462 -1.651436
C  2.413281 1.036366 1.644718
C  0.347388 -3.555296 -1.039641
C  -0.721371 -3.463742 -1.920927
C  3.294242 0.37677 -2.020663
C  3.517373 2.381085 -0.711688
C  3.781978 1.0467 -3.126858
C  4.002801 3.050047 -1.826948
C  4.137239 2.388132 -3.036273
C  4.100855 -0.131423 3.119884
H  -6.266404 2.483389 -1.83719
H  -5.147416 1.314397 -2.518289
H  -4.560058 2.567333 -1.415393
H  -7.716047 0.522369 -0.840277
H  -6.598977 -0.608158 -1.586201
H  -6.915539 -0.688667 0.152977
H  -5.255394 2.568676 1.026068
H  -6.239239 1.24465 1.667767
H  -6.948665 2.42014 0.564423
H  -2.507622 -0.560933 0.855068
H  1.081669 -3.190195 2.068369
H  2.2449 -3.432338 0.756743
H  -2.602868 -2.536609 -2.337509
H  1.193861 -4.196864 -1.2432
H  -0.729557 -4.048108 -2.831806
H  3.016811 -0.664934 -2.109089
H  3.424362 2.925145 0.218431
H  3.882944 0.520531 -4.067241
H  4.27553 4.093855 -1.743478
H  4.515705 2.910751 -3.905091
H  4.645498 -0.402857 2.220527
H  4.789248 0.327167 3.822892
H  3.664926 -1.021778 3.56574
elementType: O N C H
totalener: -1385.00020455 hartree
nucrepener: 2836.14231591 hartree
electener: -4221.14252046 hartree
oneelecener: -7523.03488652 hartree
twoeener: 3301.89236606 hartree
cpcmener: -0.04231195 hartree
kineticenergy: 1379.23566237 hartree
xcener: -132.284483049423 hartree
chargesum: -0.0000000
charge: -0.337169 -0.202943 -0.502499 -0.155774 -0.401681 0.100360 -0.127637 -0.244219 -0.163266 -0.106231 0.277166 -0.315274 -0.316883 -0.280153 0.525248 0.298677 0.148959 0.156653 0.000785 0.016263 -0.226647 0.149599 -0.186744 -0.107777 -0.179848 -0.180661 -0.154360 -0.169064 -0.137398 -0.136011 0.102814 0.104130 0.104049 0.102690 0.104919 0.103593 0.103499 0.102391 0.092915 0.171366 0.114214 0.109854 0.159297 0.147241 0.159813 0.147554 0.156343 0.157117 0.157890 0.159999 0.134583 0.133750 0.128507
qa: -0.3372 -0.2029 -0.5025 -0.1558 -0.4017 0.1004 -0.1276 -0.2442 -0.1633 -0.1062 0.2772 -0.3153 -0.3169 -0.2802 0.5252 0.2987 0.1490 0.1567 0.0008 0.0163 -0.2266 0.1496 -0.1867 -0.1078 -0.1798 -0.1807 -0.1544 -0.1691 -0.1374 -0.1360 0.1028 0.1041 0.1040 0.1027 0.1049 0.1036 0.1035 0.1024 0.0929 0.1714 0.1142 0.1099 0.1593 0.1472 0.1598 0.1476 0.1563 0.1571 0.1579 0.1600 0.1346 0.1338 0.1285
va: 2.1163 1.9871 2.0011 3.1779 3.0185 3.3958 2.9109 2.9159 2.8172 2.8464 3.7960 3.9082 3.9035 3.9123 4.2709 4.0400 3.8075 3.9157 3.7296 3.9719 3.9139 4.0508 3.9020 3.9506 3.9647 3.9443 3.9189 3.9296 3.9046 3.8379 1.0029 1.0200 1.0067 1.0032 1.0208 1.0060 1.0076 1.0075 1.0066 1.0366 0.9979 1.0025 1.0262 0.9942 0.9926 1.0228 1.0013 0.9933 0.9937 0.9892 0.9916 1.0017 0.9934
dispcorr: -0.024911983 hartree
energy: -1385.025116534863
dipole: -22.89121 24.44778 1.55657 2.69996 -4.53118 -1.83121 -8.73594 8.07233 -0.66361
magnitude: 2.49331 au
magnitude: 6.33750 debye
