program: Orca
programVersion: 5.0.2
elementType: O O O N N N N N N N C C C C C C C C C C C C C C C C C C C C H H H H H H H H H H H H H H H H H H H H H H H
charge: 0
multiplicity: 1
keywords: wb97x-d3
keywords: def2-TZVPP
keywords: def2/J RIJCOSX
keywords: DEFGRID2
keywords: scfconv7
keywords: smallprint printgap noloewdin
keywords: NOSOSCF
formula: C20H23N7O3
InChI: InChI=1/C20H23N7O3/c1-20(2,3)30-19(28)22-16-12-8-11-15(21-16)13-29-24-17(14-9-6-5-7-10-14)18-23-25-26-27(18)4/h5-12,22H,13H2,1-4H3
53 atoms
O  -3.029142 1.016946 0.314935
O  2.333242 -2.137394 -0.81043
O  -3.629683 -0.574391 1.811524
N  -1.752617 -0.736263 0.518062
N  0.023057 -2.101591 0.392205
N  1.759474 -0.092087 -2.984395
N  2.647045 -1.051857 -0.049672
N  0.051176 0.290771 -1.760569
N  0.708344 0.014439 -3.782141
N  -0.301424 0.243479 -3.041879
C  -4.132784 1.935932 0.545145
C  -5.45945 1.291984 0.169126
C  -4.127463 2.445142 1.979745
C  -3.818042 3.078413 -0.410426
C  -2.88639 -0.131053 0.964386
C  -1.148652 -1.89502 0.978313
C  0.764473 -3.138714 0.727442
C  2.201833 0.040072 -0.527982
C  2.541641 1.297619 0.158527
C  2.089983 -3.257832 0.014449
C  -1.657692 -2.768226 1.938919
C  1.344309 0.073214 -1.72896
C  0.359572 -4.064382 1.679193
C  -0.875792 -3.862622 2.274995
C  1.720397 2.419356 0.045997
C  3.68438 1.369338 0.959292
C  2.027556 3.583297 0.73432
C  3.9881 2.535297 1.639977
C  3.160338 3.645994 1.531372
C  3.084118 -0.370337 -3.4937
H  -5.756438 0.501452 0.855477
H  -5.424407 0.879753 -0.840738
H  -6.243094 2.050412 0.186497
H  -4.835714 3.269942 2.06845
H  -4.420211 1.686017 2.702193
H  -3.143677 2.827624 2.257808
H  -2.862105 3.547631 -0.170819
H  -4.590964 3.843643 -0.3424
H  -3.779641 2.735057 -1.445725
H  -1.21269 -0.257487 -0.204126
H  2.904429 -3.397567 0.732657
H  2.088012 -4.120008 -0.65541
H  -2.613834 -2.611593 2.410453
H  0.984045 -4.907262 1.944999
H  -1.238343 -4.560784 3.018632
H  0.825727 2.391138 -0.561266
H  4.341863 0.513764 1.038755
H  1.375589 4.442323 0.644839
H  4.879118 2.580197 2.252551
H  3.400991 4.557225 2.063062
H  3.095938 -0.147269 -4.555616
H  3.810436 0.260879 -2.988737
H  3.336001 -1.41679 -3.340766
elementType: O N C H
totalener: -1384.99665929 hartree
nucrepener: 2988.90256233 hartree
electener: -4373.89922162 hartree
oneelecener: -7829.37502651 hartree
twoeener: 3455.47580489 hartree
cpcmener: -0.03695293 hartree
kineticenergy: 1379.25537193 hartree
xcener: -132.293002320019 hartree
chargesum: 0.0000000
charge: -0.332160 -0.228520 -0.509897 -0.210114 -0.403157 0.111981 -0.117457 -0.258311 -0.168541 -0.121845 0.265856 -0.311858 -0.312828 -0.284129 0.522554 0.316267 0.172069 0.146927 0.034857 0.047097 -0.250947 0.207610 -0.246725 -0.086922 -0.187788 -0.196346 -0.166437 -0.154276 -0.136773 -0.131010 0.102434 0.103111 0.102334 0.101988 0.102738 0.103231 0.102144 0.094707 0.102867 0.212724 0.114975 0.121823 0.152291 0.148728 0.157504 0.155853 0.140194 0.158448 0.157935 0.160091 0.129090 0.136746 0.128865
qa: -0.3322 -0.2285 -0.5099 -0.2101 -0.4032 0.1120 -0.1175 -0.2583 -0.1685 -0.1218 0.2659 -0.3119 -0.3128 -0.2841 0.5226 0.3163 0.1721 0.1469 0.0349 0.0471 -0.2509 0.2076 -0.2467 -0.0869 -0.1878 -0.1963 -0.1664 -0.1543 -0.1368 -0.1310 0.1024 0.1031 0.1023 0.1020 0.1027 0.1032 0.1021 0.0947 0.1029 0.2127 0.1150 0.1218 0.1523 0.1487 0.1575 0.1559 0.1402 0.1584 0.1579 0.1601 0.1291 0.1367 0.1289
va: 2.1088 1.9850 2.0023 3.1624 3.0061 3.3907 2.8884 2.8479 2.8271 2.8615 3.8174 3.9054 3.9038 3.9132 4.2650 3.9756 3.8080 3.8409 3.6424 3.9231 3.9728 3.9870 3.9543 3.9274 3.9300 3.9860 3.9349 3.9184 3.9051 3.8306 1.0205 1.0065 1.0035 1.0037 1.0208 1.0065 1.0066 1.0072 1.0080 1.0510 1.0087 0.9935 1.0282 0.9969 0.9915 1.0151 1.0262 0.9937 0.9930 0.9895 1.0032 0.9898 0.9975
dispcorr: -0.028103858 hartree
energy: -1385.024763146672
dipole: -13.86887 16.70723 2.83836 14.22754 -13.97676 0.25078 6.56960 -6.44928 0.12032
magnitude: 2.85196 au
magnitude: 7.24910 debye
