program: Orca
programVersion: 5.0.2
elementType: O O O N N N N N N N C C C C C C C C C C C C C C C C C C C C H H H H H H H H H H H H H H H H H H H H H H H
charge: 0
multiplicity: 1
keywords: wb97x-d3
keywords: def2-TZVPP
keywords: def2/J RIJCOSX
keywords: DEFGRID2
keywords: scfconv7
keywords: smallprint printgap noloewdin
keywords: NOSOSCF
formula: C20H23N7O3
InChI: InChI=1/C20H23N7O3/c1-20(2,3)30-19(28)22-16-12-8-11-15(21-16)13-29-24-17(14-9-6-5-7-10-14)18-23-25-26-27(18)4/h5-12,22H,13H2,1-4H3
53 atoms
O  -4.513387 1.022607 0.139322
O  1.972243 -1.974398 -1.074324
O  -4.318203 -0.41105 1.878977
N  -2.969287 -0.522258 0.040104
N  -1.168205 -1.734029 -0.576247
N  4.777518 -1.078585 -0.926559
N  1.665554 -0.66098 -1.083562
N  4.398341 -0.259875 1.015451
N  5.824859 -1.344527 -0.166503
N  5.585795 -0.85386 0.986745
C  -5.623482 1.809474 0.665599
C  -5.223325 2.516736 1.952615
C  -5.861281 2.834108 -0.43474
C  -6.86419 0.946453 0.84403
C  -3.979519 0.001463 0.793162
C  -2.099148 -1.557966 0.351445
C  -0.243454 -2.671513 -0.409248
C  2.585191 0.098307 -0.636218
C  2.29891 1.539801 -0.542653
C  0.832014 -2.747663 -1.45557
C  -2.164937 -2.345666 1.503731
C  3.889431 -0.410598 -0.184112
C  -0.218086 -3.502132 0.699859
C  -1.204328 -3.327518 1.659643
C  3.330317 2.472794 -0.452333
C  0.975766 1.990499 -0.556978
C  3.044954 3.829328 -0.385623
C  0.697173 3.343828 -0.490758
C  1.730709 4.269575 -0.405325
C  4.728265 -1.497149 -2.309707
H  -4.297916 3.080123 1.819579
H  -5.096826 1.835661 2.791723
H  -6.003762 3.228545 2.224709
H  -4.978695 3.453842 -0.602369
H  -6.128529 2.354934 -1.378172
H  -6.681829 3.493768 -0.153325
H  -7.715454 1.590344 1.068985
H  -6.773098 0.230639 1.658613
H  -7.099014 0.40186 -0.072331
H  -2.768359 -0.075048 -0.844615
H  1.212545 -3.763443 -1.557065
H  0.456295 -2.41246 -2.424386
H  -2.929019 -2.204816 2.249684
H  0.546286 -4.259748 0.809114
H  -1.226761 -3.956432 2.540096
H  4.364839 2.155024 -0.441014
H  0.162879 1.277964 -0.610283
H  3.856546 4.541935 -0.317713
H  -0.332222 3.678139 -0.49733
H  1.509943 5.327632 -0.348593
H  5.725133 -1.413519 -2.732718
H  4.386605 -2.526548 -2.38379
H  4.056652 -0.847131 -2.863067
elementType: O N C H
totalener: -1384.99914788 hartree
nucrepener: 2833.21065935 hartree
electener: -4218.20980723 hartree
oneelecener: -7516.34822374 hartree
twoeener: 3298.13841652 hartree
cpcmener: -0.04260885 hartree
kineticenergy: 1379.22663919 hartree
xcener: -132.280360078754 hartree
chargesum: -0.0000000
charge: -0.337869 -0.215785 -0.501415 -0.159001 -0.383006 0.102588 -0.110026 -0.223898 -0.160630 -0.110303 0.270532 -0.313555 -0.280983 -0.313396 0.525532 0.313194 0.103476 0.149387 -0.000622 0.034151 -0.228206 0.135704 -0.176399 -0.110603 -0.183453 -0.178018 -0.169368 -0.157486 -0.133671 -0.137554 0.103639 0.104540 0.103086 0.102936 0.102606 0.093924 0.103498 0.104428 0.103143 0.172067 0.114902 0.106841 0.157429 0.149064 0.160433 0.158660 0.138017 0.157570 0.157226 0.159583 0.133635 0.128719 0.134737
qa: -0.3379 -0.2158 -0.5014 -0.1590 -0.3830 0.1026 -0.1100 -0.2239 -0.1606 -0.1103 0.2705 -0.3136 -0.2810 -0.3134 0.5255 0.3132 0.1035 0.1494 -0.0006 0.0342 -0.2282 0.1357 -0.1764 -0.1106 -0.1835 -0.1780 -0.1694 -0.1575 -0.1337 -0.1376 0.1036 0.1045 0.1031 0.1029 0.1026 0.0939 0.1035 0.1044 0.1031 0.1721 0.1149 0.1068 0.1574 0.1491 0.1604 0.1587 0.1380 0.1576 0.1572 0.1596 0.1336 0.1287 0.1347
va: 2.1123 1.9900 2.0037 3.1939 2.9946 3.3870 2.9134 2.9537 2.8125 2.8473 3.8041 3.9057 3.9131 3.9050 4.2691 3.9987 3.8702 3.9562 3.6755 3.9097 3.9359 4.0743 3.8998 3.9497 3.9503 3.9722 3.9173 3.9242 3.8990 3.8381 1.0063 1.0202 1.0031 1.0073 1.0076 1.0063 1.0031 1.0202 1.0065 1.0368 0.9960 1.0214 1.0268 0.9977 0.9924 0.9920 1.0193 0.9938 0.9938 0.9895 1.0020 0.9931 0.9924
dispcorr: -0.025503163 hartree
energy: -1385.024651039502
dipole: -33.30258 31.59437 -1.70821 14.49818 -14.18867 0.30951 -2.22037 -0.54468 -2.76505
magnitude: 3.26485 au
magnitude: 8.29859 debye
