program: Orca
programVersion: 5.0.2
elementType: O O O N N N N N N N C C C C C C C C C C C C C C C C C C C C H H H H H H H H H H H H H H H H H H H H H H H
charge: 0
multiplicity: 1
keywords: wb97x-d3
keywords: def2-TZVPP
keywords: def2/J RIJCOSX
keywords: DEFGRID2
keywords: scfconv7
keywords: smallprint printgap noloewdin
keywords: NOSOSCF
formula: C20H23N7O3
InChI: InChI=1/C20H23N7O3/c1-20(2,3)30-19(28)22-16-12-8-11-15(21-16)13-29-24-17(14-9-6-5-7-10-14)18-23-25-26-27(18)4/h5-12,22H,13H2,1-4H3
53 atoms
O  -6.178142 0.27969 1.085357
O  1.639829 0.281789 -0.016328
O  -5.529737 -1.858267 0.725833
N  -4.041181 -0.132843 0.882122
N  -1.797936 0.088281 0.750961
N  3.039184 -0.082323 -2.556337
N  2.760243 0.896916 0.412718
N  4.255291 -1.503623 -1.515037
N  3.180628 -1.138839 -3.336995
N  3.906763 -1.975901 -2.707782
C  -7.61372 0.032743 1.168462
C  -7.939768 -0.856151 2.360235
C  -8.180977 1.428158 1.390315
C  -8.145832 -0.539808 -0.137808
C  -5.290709 -0.682833 0.883296
C  -2.818388 -0.757011 0.685092
C  -0.561625 -0.361133 0.583085
C  3.793266 0.603738 -0.274782
C  5.083251 1.206471 0.10377
C  0.512052 0.675633 0.747458
C  -2.645239 -2.119002 0.431241
C  3.706762 -0.316527 -1.42319
C  -0.278521 -1.693896 0.326289
C  -1.351204 -2.569724 0.251172
C  5.117703 2.266764 1.015651
C  6.28445 0.735337 -0.425209
C  6.323211 2.831497 1.389236
C  7.491673 1.30436 -0.043802
C  7.517005 2.351384 0.862858
C  2.240972 1.052203 -2.963667
H  -7.606541 -1.883643 2.228517
H  -9.020849 -0.880047 2.501522
H  -7.498297 -0.463083 3.277382
H  -9.266591 1.37781 1.471947
H  -7.79854 1.874776 2.309902
H  -7.940976 2.094161 0.559728
H  -7.82345 -1.563188 -0.316916
H  -7.845376 0.073307 -0.989027
H  -9.235944 -0.541831 -0.105186
H  -3.971694 0.864117 1.036116
H  0.145802 1.651873 0.41876
H  0.787946 0.756545 1.80324
H  -3.475735 -2.801896 0.373128
H  0.734267 -2.046864 0.1944
H  -1.179055 -3.619571 0.051878
H  4.196122 2.65653 1.426575
H  6.296558 -0.08731 -1.126984
H  6.331371 3.654904 2.0917
H  8.414456 0.921355 -0.459515
H  8.459247 2.795355 1.156384
H  1.186392 0.85317 -2.79019
H  2.543366 1.93105 -2.402475
H  2.407512 1.23641 -4.020665
elementType: O N C H
totalener: -1384.99974290 hartree
nucrepener: 2701.72006307 hartree
electener: -4086.71980597 hartree
oneelecener: -7252.66304100 hartree
twoeener: 3165.94323503 hartree
cpcmener: -0.03793638 hartree
kineticenergy: 1379.22605623 hartree
xcener: -132.283915152160 hartree
chargesum: 0.0000000
charge: -0.336602 -0.210797 -0.500742 -0.154910 -0.410677 0.106297 -0.121538 -0.253022 -0.162631 -0.117059 0.273586 -0.313941 -0.279602 -0.315514 0.524195 0.301450 0.157921 0.187151 0.000439 0.030660 -0.227711 0.154877 -0.188967 -0.114829 -0.188639 -0.192518 -0.151560 -0.158645 -0.143126 -0.139665 0.104221 0.103398 0.103298 0.093789 0.102321 0.101971 0.104788 0.103757 0.103031 0.169814 0.105668 0.114747 0.160260 0.145594 0.158273 0.144128 0.154572 0.157658 0.157574 0.159554 0.128048 0.134136 0.135521
qa: -0.3366 -0.2108 -0.5007 -0.1549 -0.4107 0.1063 -0.1215 -0.2530 -0.1626 -0.1171 0.2736 -0.3139 -0.2796 -0.3155 0.5242 0.3014 0.1579 0.1872 0.0004 0.0307 -0.2277 0.1549 -0.1890 -0.1148 -0.1886 -0.1925 -0.1516 -0.1586 -0.1431 -0.1397 0.1042 0.1034 0.1033 0.0938 0.1023 0.1020 0.1048 0.1038 0.1030 0.1698 0.1057 0.1147 0.1603 0.1456 0.1583 0.1441 0.1546 0.1577 0.1576 0.1596 0.1280 0.1341 0.1355
va: 2.1136 2.0052 2.0037 3.1730 3.0421 3.3912 2.9249 2.8757 2.8171 2.8532 3.8012 3.9069 3.9125 3.9044 4.2718 4.0392 3.8458 3.8492 3.7404 3.9172 3.9076 4.0315 3.9180 3.9647 3.9730 3.9392 3.9165 3.9329 3.9118 3.8436 1.0196 1.0031 1.0066 1.0066 1.0074 1.0077 1.0202 1.0063 1.0034 1.0379 1.0128 1.0030 1.0256 1.0106 0.9944 1.0261 1.0192 0.9931 0.9937 0.9895 0.9933 0.9914 1.0014
dispcorr: -0.024265766 hartree
energy: -1385.024008669245
dipole: -38.42273 37.07673 -1.34600 8.82532 -5.64504 3.18028 7.72946 -7.13790 0.59156
magnitude: 3.50369 au
magnitude: 8.90567 debye
