program: Orca
programVersion: 5.0.2
elementType: O O O N N N N N N N C C C C C C C C C C C C C C C C C C C C H H H H H H H H H H H H H H H H H H H H H H H
charge: 0
multiplicity: 1
keywords: wb97x-d3
keywords: def2-TZVPP
keywords: def2/J RIJCOSX
keywords: DEFGRID2
keywords: scfconv7
keywords: smallprint printgap noloewdin
keywords: NOSOSCF
formula: C20H23N7O3
InChI: InChI=1/C20H23N7O3/c1-20(2,3)30-19(28)22-16-12-8-11-15(21-16)13-29-24-17(14-9-6-5-7-10-14)18-23-25-26-27(18)4/h5-12,22H,13H2,1-4H3
53 atoms
O  -6.053698 0.395299 -0.482507
O  1.713445 -0.368919 -0.60956
O  -5.507775 -1.338839 0.864098
N  -3.977464 -0.288388 -0.467269
N  -1.753817 -0.453893 -0.818706
N  3.192787 -0.324357 1.893375
N  2.66631 0.443858 -1.105633
N  4.746958 -1.410256 0.899057
N  3.612974 -1.26932 2.715733
N  4.53742 -1.907913 2.113569
C  -7.473741 0.455755 -0.152367
C  -7.969331 1.607631 -1.015497
C  -8.178061 -0.833178 -0.55196
C  -7.675184 0.786248 1.319636
C  -5.224517 -0.488934 0.05087
C  -2.80387 -0.976583 -0.197145
C  -0.55932 -1.008762 -0.669396
C  3.745238 0.439772 -0.425559
C  4.838432 1.336296 -0.841335
C  0.55347 -0.351542 -1.432781
C  -2.700631 -2.095648 0.630632
C  3.898874 -0.419051 0.762977
C  -0.349339 -2.1290 0.121498
C  -1.448251 -2.663257 0.776668
C  4.593846 2.339519 -1.785195
C  6.11904 1.219785 -0.301738
C  5.604682 3.197865 -2.176227
C  7.13029 2.083719 -0.699258
C  6.879244 3.074588 -1.634552
C  2.131222 0.580931 2.274191
H  -7.463191 2.541713 -0.765388
H  -9.037328 1.755605 -0.856729
H  -7.815481 1.4077 -2.077258
H  -7.89943 -1.68076 0.070971
H  -9.255507 -0.695096 -0.45245
H  -7.975383 -1.086778 -1.594076
H  -8.728877 1.00933 1.492144
H  -7.102629 1.669671 1.607528
H  -7.403329 -0.033672 1.9814
H  -3.863038 0.474518 -1.121218
H  0.751154 -0.889478 -2.366472
H  0.274681 0.674032 -1.682161
H  -3.55281 -2.513367 1.139507
H  0.629597 -2.576469 0.223482
H  -1.332177 -3.535345 1.407012
H  3.604239 2.456971 -2.20579
H  6.347747 0.45171 0.424153
H  5.395094 3.972919 -2.901985
H  8.118339 1.977145 -0.270774
H  7.66779 3.750929 -1.938147
H  2.173133 1.471326 1.653631
H  1.16329 0.098415 2.159138
H  2.273898 0.86939 3.311835
elementType: O N C H
totalener: -1384.99901550 hartree
nucrepener: 2716.33427104 hartree
electener: -4101.33328654 hartree
oneelecener: -7281.67787876 hartree
twoeener: 3180.34459223 hartree
cpcmener: -0.03744198 hartree
kineticenergy: 1379.21532771 hartree
xcener: -132.281052362942 hartree
chargesum: 0.0000000
charge: -0.336714 -0.203005 -0.501105 -0.154579 -0.401218 0.102522 -0.130655 -0.248490 -0.160068 -0.117160 0.270698 -0.278726 -0.314961 -0.312019 0.524380 0.308075 0.157855 0.198928 -0.003218 0.042368 -0.231609 0.141608 -0.223065 -0.097358 -0.187830 -0.194723 -0.151226 -0.157317 -0.144298 -0.139620 0.102513 0.093608 0.102171 0.105082 0.103128 0.103243 0.103493 0.103243 0.103620 0.170109 0.114429 0.098064 0.158853 0.147762 0.160200 0.145016 0.154671 0.157422 0.158715 0.159684 0.133065 0.127490 0.136951
qa: -0.3367 -0.2030 -0.5011 -0.1546 -0.4012 0.1025 -0.1307 -0.2485 -0.1601 -0.1172 0.2707 -0.2787 -0.3150 -0.3120 0.5244 0.3081 0.1579 0.1989 -0.0032 0.0424 -0.2316 0.1416 -0.2231 -0.0974 -0.1878 -0.1947 -0.1512 -0.1573 -0.1443 -0.1396 0.1025 0.0936 0.1022 0.1051 0.1031 0.1032 0.1035 0.1032 0.1036 0.1701 0.1144 0.0981 0.1589 0.1478 0.1602 0.1450 0.1547 0.1574 0.1587 0.1597 0.1331 0.1275 0.1370
va: 2.1137 2.0208 2.0036 3.1746 3.0509 3.3956 2.9467 2.8996 2.8136 2.8501 3.8043 3.9119 3.9052 3.9058 4.2716 4.0223 3.8895 3.8212 3.7579 3.8943 3.9190 4.0748 3.8914 3.9366 3.9693 3.9413 3.9167 3.9306 3.9129 3.8479 1.0075 1.0066 1.0077 1.0201 1.0032 1.0065 1.0031 1.0066 1.0199 1.0376 0.9956 1.0238 1.0260 1.0091 0.9932 1.0262 1.0197 0.9932 0.9932 0.9895 0.9922 0.9874 1.0018
dispcorr: -0.024666673 hartree
energy: -1385.023682172415
dipole: -40.17235 38.07743 -2.09492 11.24998 -8.57879 2.67118 -2.32232 1.46731 -0.85501
magnitude: 3.50071 au
magnitude: 8.89809 debye
