program: Orca
programVersion: 5.0.2
elementType: O O O N N N N N N N C C C C C C C C C C C C C C C C C C C C H H H H H H H H H H H H H H H H H H H H H H H
charge: 0
multiplicity: 1
keywords: wb97x-d3
keywords: def2-TZVPP
keywords: def2/J RIJCOSX
keywords: DEFGRID2
keywords: scfconv7
keywords: smallprint printgap noloewdin
keywords: NOSOSCF
formula: C20H23N7O3
InChI: InChI=1/C20H23N7O3/c1-20(2,3)30-19(28)22-16-12-8-11-15(21-16)13-29-24-17(14-9-6-5-7-10-14)18-23-25-26-27(18)4/h5-12,22H,13H2,1-4H3
53 atoms
O  -6.213958 0.308119 -0.501832
O  1.675989 -0.113079 -0.495497
O  -5.626253 -1.529196 0.68309
N  -4.10748 -0.262129 -0.461563
N  -1.863085 -0.209998 -0.672222
N  3.412817 -0.50523 1.824133
N  2.64483 0.693138 -0.976883
N  4.682992 -1.617864 0.508167
N  3.793518 -1.598092 2.462138
N  4.548139 -2.251336 1.669063
C  -7.632754 0.319565 -0.165188
C  -8.144568 1.533554 -0.927631
C  -8.322744 -0.94085 -0.666765
C  -7.8286 0.52419 1.330334
C  -5.3596 -0.583028 -0.021982
C  -2.89653 -0.87157 -0.170152
C  -0.632072 -0.662511 -0.474874
C  3.78211 0.500789 -0.433654
C  4.916904 1.33866 -0.857458
C  0.43448 0.177099 -1.115344
C  -2.743853 -2.045046 0.571497
C  3.964243 -0.526119 0.608137
C  -0.368438 -1.818922 0.242625
C  -1.455585 -2.504588 0.766939
C  6.20768 1.096275 -0.389064
C  4.706276 2.410914 -1.73123
C  7.263084 1.905552 -0.787085
C  5.760679 3.214834 -2.121882
C  7.045494 2.965917 -1.651588
C  2.518804 0.452267 2.435155
H  -7.648432 2.44884 -0.59986
H  -9.213908 1.655314 -0.756723
H  -7.9894 1.425756 -2.002507
H  -8.103806 -1.117145 -1.721273
H  -8.045843 -1.828597 -0.101642
H  -9.402403 -0.816896 -0.572903
H  -7.256799 1.381796 1.689165
H  -7.550299 -0.348181 1.918694
H  -8.881861 0.728002 1.527201
H  -4.015832 0.572458 -1.025283
H  0.487429 -0.039307 -2.187743
H  0.185001 1.234576 -0.998097
H  -3.585603 -2.579544 0.978672
H  0.637244 -2.185246 0.389535
H  -1.297169 -3.412234 1.334892
H  6.409388 0.274425 0.284177
H  3.710938 2.620967 -2.098887
H  8.258961 1.702039 -0.41584
H  5.579994 4.04347 -2.79422
H  7.869107 3.598094 -1.957125
H  2.592208 1.400655 1.911396
H  1.494141 0.090199 2.395762
H  2.814244 0.59968 3.469938
elementType: O N C H
totalener: -1384.99981711 hartree
nucrepener: 2707.27823862 hartree
electener: -4092.27805573 hartree
oneelecener: -7263.52206360 hartree
twoeener: 3171.24400787 hartree
cpcmener: -0.03807286 hartree
kineticenergy: 1379.21890189 hartree
xcener: -132.282881346706 hartree
chargesum: -0.0000000
charge: -0.335976 -0.201583 -0.500108 -0.155706 -0.415215 0.110603 -0.136103 -0.242817 -0.161519 -0.111257 0.269271 -0.278939 -0.311958 -0.314096 0.524183 0.295246 0.178173 0.192968 -0.005130 0.026074 -0.226850 0.127565 -0.209110 -0.104887 -0.186885 -0.183956 -0.161750 -0.152071 -0.141354 -0.139052 0.102640 0.093434 0.102388 0.103249 0.103779 0.103243 0.104431 0.103732 0.103581 0.169571 0.117201 0.103239 0.159305 0.149736 0.159062 0.153887 0.146643 0.158762 0.157986 0.160086 0.131883 0.127301 0.137101
qa: -0.3360 -0.2016 -0.5001 -0.1557 -0.4152 0.1106 -0.1361 -0.2428 -0.1615 -0.1113 0.2693 -0.2789 -0.3120 -0.3141 0.5242 0.2952 0.1782 0.1930 -0.0051 0.0261 -0.2268 0.1276 -0.2091 -0.1049 -0.1869 -0.1840 -0.1617 -0.1521 -0.1414 -0.1391 0.1026 0.0934 0.1024 0.1032 0.1038 0.1032 0.1044 0.1037 0.1036 0.1696 0.1172 0.1032 0.1593 0.1497 0.1591 0.1539 0.1466 0.1588 0.1580 0.1601 0.1319 0.1273 0.1371
va: 2.1119 2.0138 2.0058 3.1695 3.0355 3.3950 2.9503 2.9006 2.8152 2.8458 3.8059 3.9123 3.9048 3.9062 4.2738 4.0478 3.8322 3.8224 3.7675 3.9450 3.9103 4.0687 3.9042 3.9491 3.9439 3.9638 3.9304 3.9171 3.9096 3.8482 1.0073 1.0066 1.0077 1.0066 1.0200 1.0034 1.0064 1.0193 1.0031 1.0384 0.9990 1.0139 1.0250 1.0058 0.9938 1.0125 1.0270 0.9932 0.9931 0.9892 0.9921 0.9892 1.0014
dispcorr: -0.024707067 hartree
energy: -1385.024524174553
dipole: -39.96987 38.22753 -1.74234 11.34857 -8.26663 3.08194 -0.58701 0.37845 -0.20856
magnitude: 3.54649 au
magnitude: 9.01446 debye
