program: Orca
programVersion: 5.0.2
elementType: O O O N N N N N N N C C C C C C C C C C C C C C C C C C C C H H H H H H H H H H H H H H H H H H H H H H H
charge: 0
multiplicity: 1
keywords: wb97x-d3
keywords: def2-TZVPP
keywords: def2/J RIJCOSX
keywords: DEFGRID2
keywords: scfconv7
keywords: smallprint printgap noloewdin
keywords: NOSOSCF
formula: C20H23N7O3
InChI: InChI=1/C20H23N7O3/c1-20(2,3)30-19(28)22-16-12-8-11-15(21-16)13-29-24-17(14-9-6-5-7-10-14)18-23-25-26-27(18)4/h5-12,22H,13H2,1-4H3
53 atoms
O  -5.199601 0.708102 1.454012
O  2.016861 -1.903825 0.485876
O  -4.934204 0.32522 -0.759593
N  -3.430809 -0.39871 0.799622
N  -1.400307 -1.387963 0.745699
N  4.867047 -1.735868 -0.159684
N  2.025844 -0.551411 0.47801
N  4.336991 -0.893156 -2.055528
N  5.646098 -2.28364 -1.075173
N  5.317513 -1.777792 -2.199245
C  -6.442259 1.468104 1.368948
C  -6.235131 2.757057 0.586253
C  -7.561949 0.615192 0.789519
C  -6.738648 1.791421 2.826567
C  -4.571088 0.229981 0.390781
C  -2.443357 -0.990626 0.025073
C  -0.372524 -1.965284 0.141993
C  3.016665 -0.043097 -0.140246
C  3.092377 1.422839 -0.249888
C  0.782676 -2.366965 1.017794
C  -2.503737 -1.158477 -1.358426
C  4.05133 -0.875382 -0.775593
C  -0.33269 -2.180215 -1.228236
C  -1.423436 -1.76565 -1.973823
C  1.967345 2.20502 0.027793
C  4.280798 2.053077 -0.613705
C  2.037686 3.583735 -0.049638
C  4.345315 3.437193 -0.690964
C  3.227676 4.206335 -0.408294
C  4.975528 -2.103962 1.234908
H  -7.123184 3.382027 0.688868
H  -6.075053 2.590012 -0.476849
H  -5.389709 3.324077 0.979682
H  -7.435876 0.408628 -0.270937
H  -7.648201 -0.334192 1.320437
H  -8.509026 1.14286 0.909041
H  -5.939131 2.382759 3.276222
H  -6.87074 0.884853 3.419645
H  -7.659157 2.370409 2.896364
H  -3.220905 -0.384399 1.788888
H  0.634354 -1.996017 2.034443
H  0.888337 -3.452296 1.058093
H  -3.351117 -0.833783 -1.938249
H  0.518877 -2.654457 -1.697324
H  -1.438904 -1.913785 -3.045799
H  1.032473 1.732147 0.297056
H  5.170015 1.476697 -0.832797
H  1.157865 4.176232 0.164909
H  5.27555 3.912047 -0.973353
H  3.278913 5.285471 -0.471323
H  4.57116 -1.310316 1.854072
H  4.436101 -3.027433 1.425953
H  6.024098 -2.238831 1.47906
elementType: O N C H
totalener: -1385.00050072 hartree
nucrepener: 2781.25551544 hartree
electener: -4166.25601616 hartree
oneelecener: -7412.29264837 hartree
twoeener: 3246.03663222 hartree
cpcmener: -0.04082563 hartree
kineticenergy: 1379.23926033 hartree
xcener: -132.283945371393 hartree
chargesum: -0.0000000
charge: -0.336944 -0.214608 -0.501855 -0.159454 -0.391731 0.105020 -0.128395 -0.227878 -0.160911 -0.109060 0.272662 -0.314027 -0.313481 -0.280374 0.524443 0.302546 0.130202 0.156259 -0.008707 0.066808 -0.223176 0.141082 -0.211954 -0.111176 -0.182166 -0.180298 -0.153478 -0.171226 -0.133006 -0.135365 0.103005 0.104635 0.103857 0.104060 0.103357 0.102904 0.102430 0.102262 0.093723 0.169998 0.101836 0.116857 0.160904 0.142858 0.159976 0.146090 0.159360 0.157926 0.157757 0.160017 0.133985 0.129033 0.133420
qa: -0.3369 -0.2146 -0.5019 -0.1595 -0.3917 0.1050 -0.1284 -0.2279 -0.1609 -0.1091 0.2727 -0.3140 -0.3135 -0.2804 0.5244 0.3025 0.1302 0.1563 -0.0087 0.0668 -0.2232 0.1411 -0.2120 -0.1112 -0.1822 -0.1803 -0.1535 -0.1712 -0.1330 -0.1354 0.1030 0.1046 0.1039 0.1041 0.1034 0.1029 0.1024 0.1023 0.0937 0.1700 0.1018 0.1169 0.1609 0.1429 0.1600 0.1461 0.1594 0.1579 0.1578 0.1600 0.1340 0.1290 0.1334
va: 2.1136 1.9810 2.0027 3.1788 3.0203 3.3877 2.9235 2.9415 2.8117 2.8470 3.8015 3.9054 3.9057 3.9129 4.2731 4.0235 3.8635 3.9461 3.6937 3.8380 3.9063 4.0524 3.8948 3.9554 3.9682 3.9519 3.9198 3.9228 3.8994 3.8383 1.0032 1.0199 1.0063 1.0201 1.0065 1.0034 1.0076 1.0076 1.0065 1.0379 1.0271 0.9952 1.0256 1.0089 0.9937 1.0204 0.9927 0.9931 0.9938 0.9891 0.9931 0.9935 1.0017
dispcorr: -0.025054009 hartree
energy: -1385.025554731292
dipole: -35.00425 33.90506 -1.09919 14.01112 -13.40377 0.60735 13.26995 -10.13631 3.13364
magnitude: 3.37592 au
magnitude: 8.58090 debye
