program: Orca
programVersion: 5.0.2
elementType: O O O N N N N N N N C C C C C C C C C C C C C C C C C C C C H H H H H H H H H H H H H H H H H H H H H H H
charge: 0
multiplicity: 1
keywords: wb97x-d3
keywords: def2-TZVPP
keywords: def2/J RIJCOSX
keywords: DEFGRID2
keywords: scfconv7
keywords: smallprint printgap noloewdin
keywords: NOSOSCF
formula: C20H23N7O3
InChI: InChI=1/C20H23N7O3/c1-20(2,3)30-19(28)22-16-12-8-11-15(21-16)13-29-24-17(14-9-6-5-7-10-14)18-23-25-26-27(18)4/h5-12,22H,13H2,1-4H3
53 atoms
O  -5.408899 0.86054 0.224131
O  1.733788 -1.645771 -1.49677
O  -4.551306 -0.00025 2.132531
N  -3.541006 -0.267709 0.10078
N  -1.60722 -1.165849 -0.643915
N  4.666477 -1.585184 -1.646761
N  1.818087 -0.342255 -1.145342
N  4.725964 -1.260286 0.468932
N  5.643168 -2.325188 -1.153261
N  5.666208 -2.12508 0.106343
C  -6.576964 1.505132 0.814316
C  -7.245756 2.1534 -0.389717
C  -7.508807 0.472561 1.43258
C  -6.161245 2.576788 1.812684
C  -4.518176 0.188032 0.93761
C  -2.385071 -0.968004 0.414964
C  -0.461182 -1.81396 -0.500686
C  2.965733 0.010485 -0.720458
C  3.136952 1.39602 -0.252287
C  0.374106 -1.980057 -1.741388
C  -2.040106 -1.417589 1.689627
C  4.094646 -0.930003 -0.632467
C  -0.027071 -2.306093 0.721924
C  -0.840896 -2.095348 1.822376
C  2.015123 2.186111 0.0156
C  4.406968 1.941901 -0.073938
C  2.16604 3.491264 0.446923
C  4.552488 3.252073 0.360429
C  3.435738 4.030078 0.62201
C  4.3710 -1.584181 -3.062454
H  -6.588142 2.881067 -0.868361
H  -8.147511 2.67771 -0.0743
H  -7.536327 1.410398 -1.134365
H  -8.448692 0.957074 1.700567
H  -7.741255 -0.322974 0.722598
H  -7.10489 0.022108 2.337192
H  -7.039132 3.159876 2.094141
H  -5.438681 3.266077 1.372235
H  -5.735812 2.167243 2.726449
H  -3.62052 -0.030841 -0.879145
H  0.397779 -3.022201 -2.064441
H  -0.034439 -1.376179 -2.555059
H  -2.670717 -1.250243 2.546414
H  0.912545 -2.83412 0.814029
H  -0.543355 -2.459894 2.797059
H  1.021978 1.774342 -0.105694
H  5.295013 1.357324 -0.27567
H  1.288594 4.08967 0.654909
H  5.545061 3.661406 0.495541
H  3.550989 5.050306 0.964359
H  5.306521 -1.623682 -3.612699
H  3.758752 -2.444245 -3.322268
H  3.847776 -0.669418 -3.324904
elementType: O N C H
totalener: -1385.00051710 hartree
nucrepener: 2780.10757237 hartree
electener: -4165.10808946 hartree
oneelecener: -7409.97404426 hartree
twoeener: 3244.86595480 hartree
cpcmener: -0.04067195 hartree
kineticenergy: 1379.22621809 hartree
xcener: -132.281743525709 hartree
chargesum: -0.0000000
charge: -0.336599 -0.215684 -0.501720 -0.157110 -0.392525 0.105463 -0.126504 -0.227871 -0.161169 -0.109137 0.273086 -0.279479 -0.313894 -0.314840 0.522986 0.302516 0.132619 0.152307 -0.005834 0.067846 -0.223857 0.142167 -0.215341 -0.108988 -0.182716 -0.181523 -0.154430 -0.170566 -0.132754 -0.136020 0.102478 0.093706 0.102062 0.103077 0.103348 0.103965 0.103046 0.103942 0.104216 0.169811 0.115605 0.102175 0.159810 0.143867 0.159395 0.146911 0.159112 0.157804 0.157940 0.160093 0.133668 0.129672 0.133869
qa: -0.3366 -0.2157 -0.5017 -0.1571 -0.3925 0.1055 -0.1265 -0.2279 -0.1612 -0.1091 0.2731 -0.2795 -0.3139 -0.3148 0.5230 0.3025 0.1326 0.1523 -0.0058 0.0678 -0.2239 0.1422 -0.2153 -0.1090 -0.1827 -0.1815 -0.1544 -0.1706 -0.1328 -0.1360 0.1025 0.0937 0.1021 0.1031 0.1033 0.1040 0.1030 0.1039 0.1042 0.1698 0.1156 0.1022 0.1598 0.1439 0.1594 0.1469 0.1591 0.1578 0.1579 0.1601 0.1337 0.1297 0.1339
va: 2.1133 1.9816 2.0030 3.1774 3.0217 3.3871 2.9192 2.9419 2.8117 2.8472 3.8012 3.9125 3.9064 3.9050 4.2742 4.0246 3.8609 3.9484 3.6882 3.8393 3.9062 4.0497 3.8944 3.9543 3.9666 3.9534 3.9221 3.9199 3.8994 3.8371 1.0077 1.0066 1.0077 1.0032 1.0066 1.0197 1.0032 1.0062 1.0203 1.0381 0.9953 1.0268 1.0263 1.0086 0.9939 1.0199 0.9931 0.9931 0.9938 0.9890 1.0014 0.9933 0.9930
dispcorr: -0.025114853 hartree
energy: -1385.025631949103
dipole: -37.11691 35.23417 -1.88274 15.44984 -14.11317 1.33667 0.69330 -3.12557 -2.43227
magnitude: 3.35370 au
magnitude: 8.52444 debye
