program: Orca
programVersion: 5.0.2
elementType: O O O N N N N N N N C C C C C C C C C C C C C C C C C C C C H H H H H H H H H H H H H H H H H H H H H H H
charge: 0
multiplicity: 1
keywords: wb97x-d3
keywords: def2-TZVPP
keywords: def2/J RIJCOSX
keywords: DEFGRID2
keywords: scfconv7
keywords: smallprint printgap noloewdin
keywords: NOSOSCF
formula: C20H23N7O3
InChI: InChI=1/C20H23N7O3/c1-20(2,3)30-19(28)22-16-12-8-11-15(21-16)13-29-24-17(14-9-6-5-7-10-14)18-23-25-26-27(18)4/h5-12,22H,13H2,1-4H3
53 atoms
O  -5.472851 0.767329 0.310878
O  1.720794 -1.592895 -1.489595
O  -4.567215 -0.070059 2.208078
N  -3.573321 -0.30431 0.164939
N  -1.626309 -1.152539 -0.60205
N  4.642607 -1.532224 -1.716378
N  1.818501 -0.292573 -1.129197
N  4.688542 -1.35092 0.416499
N  5.587403 -2.337892 -1.265332
N  5.604425 -2.221418 0.004409
C  -6.655768 1.369451 0.915771
C  -7.362753 1.993693 -0.278993
C  -7.542019 0.303601 1.544504
C  -6.264936 2.454509 1.90962
C  -4.554075 0.120772 1.013234
C  -2.396565 -0.975049 0.465808
C  -0.463251 -1.772133 -0.472127
C  2.977753 0.04634 -0.724453
C  3.1912 1.439326 -0.295353
C  0.358154 -1.919205 -1.723818
C  -2.025745 -1.41678 1.736004
C  4.08297 -0.926083 -0.666016
C  -0.002875 -2.255084 0.744546
C  -0.808723 -2.064752 1.854437
C  4.443929 1.877926 0.130543
C  2.128683 2.349425 -0.315236
C  4.630823 3.195523 0.526361
C  2.321599 3.660936 0.076018
C  3.574455 4.091217 0.499353
C  4.342995 -1.434517 -3.127478
H  -6.738044 2.74485 -0.765383
H  -8.278527 2.485202 0.048647
H  -7.636149 1.241156 -1.020576
H  -7.759969 -0.49554 0.833994
H  -7.107954 -0.137997 2.439436
H  -8.492539 0.755191 1.831471
H  -5.58319 3.17633 1.456372
H  -5.800491 2.059952 2.810927
H  -7.160594 2.997407 2.2143
H  -3.670792 -0.07001 -0.813959
H  0.375568 -2.956164 -2.064001
H  -0.057646 -1.301788 -2.523553
H  -2.649878 -1.264812 2.600261
H  0.950667 -2.759431 0.825334
H  -0.490666 -2.421809 2.825396
H  5.288182 1.202674 0.162873
H  1.14762 2.029603 -0.639735
H  5.609767 3.517876 0.856158
H  1.489384 4.352544 0.051606
H  3.72222 5.11881 0.80522
H  5.272684 -1.483477 -3.686912
H  3.690072 -2.248548 -3.433374
H  3.860105 -0.482849 -3.330905
elementType: O N C H
totalener: -1385.00026561 hartree
nucrepener: 2774.22397802 hartree
electener: -4159.22424363 hartree
oneelecener: -7398.22508798 hartree
twoeener: 3239.00084435 hartree
cpcmener: -0.03989242 hartree
kineticenergy: 1379.22942627 hartree
xcener: -132.282981494747 hartree
chargesum: 0.0000000
charge: -0.336702 -0.214786 -0.501751 -0.157216 -0.395655 0.102385 -0.128969 -0.248227 -0.163379 -0.107953 0.272300 -0.279546 -0.313061 -0.314338 0.523512 0.305976 0.138007 0.161059 0.001256 0.066022 -0.228566 0.155123 -0.219140 -0.106080 -0.181920 -0.180580 -0.167403 -0.153739 -0.137226 -0.134789 0.102167 0.093794 0.102063 0.103400 0.103465 0.102916 0.103492 0.104457 0.103033 0.169802 0.116236 0.102994 0.159893 0.143908 0.159126 0.155665 0.147288 0.157617 0.157843 0.159944 0.133602 0.129151 0.133531
qa: -0.3367 -0.2148 -0.5018 -0.1572 -0.3957 0.1024 -0.1290 -0.2482 -0.1634 -0.1080 0.2723 -0.2795 -0.3131 -0.3143 0.5235 0.3060 0.1380 0.1611 0.0013 0.0660 -0.2286 0.1551 -0.2191 -0.1061 -0.1819 -0.1806 -0.1674 -0.1537 -0.1372 -0.1348 0.1022 0.0938 0.1021 0.1034 0.1035 0.1029 0.1035 0.1045 0.1030 0.1698 0.1162 0.1030 0.1599 0.1439 0.1591 0.1557 0.1473 0.1576 0.1578 0.1599 0.1336 0.1292 0.1335
va: 2.1133 1.9801 2.0026 3.1788 3.0263 3.3919 2.9158 2.9012 2.8158 2.8468 3.8028 3.9124 3.9059 3.9050 4.2728 4.0250 3.8564 3.9070 3.7327 3.8431 3.9099 4.0233 3.9027 3.9502 3.9445 3.9645 3.9326 3.9163 3.9061 3.8378 1.0078 1.0066 1.0077 1.0065 1.0202 1.0032 1.0064 1.0205 1.0032 1.0381 0.9949 1.0258 1.0263 1.0090 0.9941 1.0041 1.0244 0.9937 0.9931 0.9893 1.0015 0.9933 0.9925
dispcorr: -0.024930638 hartree
energy: -1385.025196245638
dipole: -37.27357 35.42831 -1.84526 15.27287 -13.74725 1.52562 1.06958 -3.48453 -2.41495
magnitude: 3.40066 au
magnitude: 8.64379 debye
