program: Orca
programVersion: 5.0.2
elementType: O O O N N N N N N N C C C C C C C C C C C C C C C C C C C C H H H H H H H H H H H H H H H H H H H H H H H
charge: 0
multiplicity: 1
keywords: wb97x-d3
keywords: def2-TZVPP
keywords: def2/J RIJCOSX
keywords: DEFGRID2
keywords: scfconv7
keywords: smallprint printgap noloewdin
keywords: NOSOSCF
formula: C20H23N7O3
InChI: InChI=1/C20H23N7O3/c1-20(2,3)30-19(28)22-16-12-8-11-15(21-16)13-29-24-17(14-9-6-5-7-10-14)18-23-25-26-27(18)4/h5-12,22H,13H2,1-4H3
53 atoms
O  -3.393009 0.980554 0.029001
O  2.35263 -1.982908 0.599252
O  -4.261177 -0.95767 -0.755455
N  -2.094214 -0.769723 -0.053342
N  -0.271701 -2.094021 0.004687
N  2.177791 0.375741 2.462775
N  2.315297 -1.055471 -0.383792
N  4.184229 0.749795 1.818855
N  2.888916 0.698322 3.529169
N  4.081167 0.914262 3.13425
C  -4.58461 1.807607 -0.117022
C  -4.108509 3.167479 0.374016
C  -5.003779 1.900604 -1.577073
C  -5.707753 1.296044 0.773565
C  -3.351006 -0.300422 -0.304728
C  -1.559513 -2.022887 -0.313909
C  0.403784 -3.205867 -0.220332
C  2.604934 0.120899 0.007358
C  2.520265 1.215428 -0.975963
C  1.872601 -3.221642 0.124731
C  -2.252776 -3.103251 -0.855466
C  2.98796 0.410256 1.402317
C  -0.18798 -4.336557 -0.76638
C  -1.536437 -4.269039 -1.073054
C  1.738268 1.05243 -2.123386
C  3.191512 2.421703 -0.781877
C  1.643328 2.068865 -3.057058
C  3.092264 3.437698 -1.721958
C  2.321966 3.265694 -2.861478
C  0.758282 0.11596 2.557123
H  -4.924758 3.887654 0.320331
H  -3.287902 3.548242 -0.236512
H  -3.77209 3.123052 1.411372
H  -5.773938 2.666598 -1.677461
H  -4.164742 2.195568 -2.209814
H  -5.417535 0.970341 -1.960951
H  -6.51695 2.027544 0.783545
H  -5.367461 1.170531 1.80301
H  -6.126141 0.352207 0.429185
H  -1.422068 -0.106867 0.309331
H  2.061017 -3.928826 0.93459
H  2.454173 -3.55498 -0.740721
H  -3.299557 -3.048469 -1.10335
H  0.388078 -5.234838 -0.946613
H  -2.041039 -5.128658 -1.494949
H  1.189788 0.132572 -2.277154
H  3.808132 2.576926 0.093308
H  1.02926 1.929671 -3.937365
H  3.623207 4.366527 -1.559226
H  2.243528 4.061148 -3.591296
H  0.207115 1.054088 2.550848
H  0.442724 -0.502791 1.722592
H  0.562174 -0.415675 3.483849
elementType: O N C H
totalener: -1384.99749430 hartree
nucrepener: 2916.61048171 hartree
electener: -4301.60797601 hartree
oneelecener: -7682.11803629 hartree
twoeener: 3380.51006028 hartree
cpcmener: -0.03977766 hartree
kineticenergy: 1379.23819546 hartree
xcener: -132.289212862930 hartree
chargesum: 0.0000000
charge: -0.334893 -0.213536 -0.501229 -0.169754 -0.415317 0.096725 -0.097226 -0.244954 -0.164824 -0.116638 0.266507 -0.280272 -0.312602 -0.311981 0.522336 0.328517 0.183747 0.171099 0.031202 0.019019 -0.241380 0.135862 -0.228790 -0.094616 -0.205883 -0.190682 -0.154725 -0.157979 -0.144852 -0.111869 0.094678 0.103019 0.101935 0.102865 0.103646 0.103897 0.103477 0.102873 0.104333 0.184717 0.124633 0.119522 0.155303 0.150962 0.158982 0.143582 0.154533 0.157625 0.158531 0.159266 0.135901 0.083360 0.131351
qa: -0.3349 -0.2135 -0.5012 -0.1698 -0.4153 0.0967 -0.0972 -0.2450 -0.1648 -0.1166 0.2665 -0.2803 -0.3126 -0.3120 0.5223 0.3285 0.1837 0.1711 0.0312 0.0190 -0.2414 0.1359 -0.2288 -0.0946 -0.2059 -0.1907 -0.1547 -0.1580 -0.1449 -0.1119 0.0947 0.1030 0.1019 0.1029 0.1036 0.1039 0.1035 0.1029 0.1043 0.1847 0.1246 0.1195 0.1553 0.1510 0.1590 0.1436 0.1545 0.1576 0.1585 0.1593 0.1359 0.0834 0.1314
va: 2.1108 2.0083 2.0077 3.2065 2.9791 3.3959 2.9182 2.9164 2.8149 2.8497 3.8114 3.9120 3.9036 3.9056 4.2695 3.9470 3.7961 3.8806 3.6630 3.9379 3.9622 4.0997 3.9463 3.9382 3.9782 3.9367 3.9263 3.9260 3.9099 3.8311 1.0067 1.0074 1.0075 1.0032 1.0064 1.0201 1.0033 1.0067 1.0194 1.0228 0.9943 1.0040 1.0271 0.9953 0.9912 1.0210 1.0211 0.9931 0.9934 0.9896 0.9941 1.0237 1.0020
dispcorr: -0.027029522 hartree
energy: -1385.024523824054
dipole: -32.26063 29.52161 -2.73901 12.08504 -12.35216 -0.26712 -7.29679 5.99655 -1.30024
magnitude: 3.04371 au
magnitude: 7.73649 debye
