program: Orca
programVersion: 5.0.2
elementType: O O O N N N N N N N C C C C C C C C C C C C C C C C C C C C H H H H H H H H H H H H H H H H H H H H H H H
charge: 0
multiplicity: 1
keywords: wb97x-d3
keywords: def2-TZVPP
keywords: def2/J RIJCOSX
keywords: DEFGRID2
keywords: scfconv7
keywords: smallprint printgap noloewdin
keywords: NOSOSCF
formula: C20H23N7O3
InChI: InChI=1/C20H23N7O3/c1-20(2,3)30-19(28)22-16-12-8-11-15(21-16)13-29-24-17(14-9-6-5-7-10-14)18-23-25-26-27(18)4/h5-12,22H,13H2,1-4H3
53 atoms
O  -4.389354 0.321873 0.360498
O  1.845647 -1.908952 -1.068634
O  -3.90023 -0.366958 2.461538
N  -2.610484 -0.914335 0.655349
N  -0.64809 -1.985863 0.33437
N  1.351768 0.492749 -2.775122
N  2.496559 -1.042373 -0.256705
N  3.431923 0.330523 -3.254976
N  1.479973 0.686059 -4.080927
N  2.719326 0.584797 -4.351852
C  -5.588854 1.068813 0.695286
C  -6.037295 1.613839 -0.654654
C  -6.660355 0.148129 1.266962
C  -5.265572 2.220936 1.639772
C  -3.671971 -0.314805 1.280782
C  -1.570617 -1.638863 1.218518
C  0.412902 -2.674399 0.735348
C  2.859471 0.026245 -0.846725
C  3.551252 1.060433 -0.057659
C  1.418978 -3.0317 -0.325474
C  -1.489135 -1.984766 2.570827
C  2.570017 0.267766 -2.27236
C  0.59563 -3.057344 2.05187
C  -0.382941 -2.705433 2.97121
C  3.483298 1.035346 1.337692
C  4.269325 2.078544 -0.681554
C  4.119681 2.008023 2.085384
C  4.906672 3.050857 0.074805
C  4.832852 3.021658 1.457324
C  0.069511 0.552863 -2.116189
H  -6.251907 0.808468 -1.357895
H  -5.277006 2.259518 -1.095608
H  -6.945711 2.203237 -0.533837
H  -6.397854 -0.236134 2.249581
H  -7.594728 0.702261 1.363733
H  -6.847196 -0.694698 0.600094
H  -4.987753 1.880133 2.634025
H  -6.143726 2.859992 1.738504
H  -4.456683 2.836378 1.243319
H  -2.5317 -0.799322 -0.343145
H  2.276372 -3.545222 0.118931
H  0.969233 -3.697221 -1.064005
H  -2.255621 -1.699008 3.271108
H  1.479737 -3.602635 2.351405
H  -0.28118 -2.987687 4.010822
H  2.920534 0.254531 1.8308
H  4.356375 2.104197 -1.759146
H  4.053811 1.980566 3.164994
H  5.464627 3.831845 -0.424173
H  5.326546 3.784108 2.045259
H  -0.67088 0.821036 -2.863413
H  -0.177666 -0.409267 -1.672381
H  0.083464 1.313261 -1.337335
totalener: -1384.97163539 hartree
nucrepener: 2852.26522913 hartree
electener: -4237.23686452 hartree
oneelecener: -7553.13553733 hartree
twoeener: 3315.89867281 hartree
kineticenergy: 1379.29765000 hartree
xcener: -132.290410321067 hartree
chargesum: 0.0000000
charge: -0.326061 -0.188230 -0.426628 -0.177626 -0.401264 0.084882 -0.106893 -0.199509 -0.150519 -0.081289 0.237112 -0.251525 -0.302022 -0.300922 0.494093 0.307374 0.126690 0.141736 -0.011105 0.034523 -0.196966 0.126802 -0.150272 -0.088528 -0.161088 -0.168111 -0.117681 -0.122303 -0.116950 -0.157643 0.096735 0.095457 0.081397 0.117955 0.089183 0.094827 0.118200 0.089315 0.093500 0.155602 0.094684 0.099998 0.153540 0.116509 0.131666 0.126263 0.154102 0.125814 0.129320 0.128111 0.126802 0.110256 0.120689
qa: -0.3261 -0.1882 -0.4266 -0.1776 -0.4013 0.0849 -0.1069 -0.1995 -0.1505 -0.0813 0.2371 -0.2515 -0.3020 -0.3009 0.4941 0.3074 0.1267 0.1417 -0.0111 0.0345 -0.1970 0.1268 -0.1503 -0.0885 -0.1611 -0.1681 -0.1177 -0.1223 -0.1170 -0.1576 0.0967 0.0955 0.0814 0.1180 0.0892 0.0948 0.1182 0.0893 0.0935 0.1556 0.0947 0.1000 0.1535 0.1165 0.1317 0.1263 0.1541 0.1258 0.1293 0.1281 0.1268 0.1103 0.1207
va: 2.1059 2.0048 2.0737 3.1837 3.0231 3.3355 2.9042 2.8991 2.8016 2.8578 3.8771 3.9105 3.9075 3.9066 4.2719 4.0196 3.8773 3.8934 3.7735 3.9534 3.9686 4.0895 3.9322 3.9774 4.0177 3.9703 3.9529 3.9659 3.9603 3.8264 1.0107 1.0109 1.0104 1.0190 1.0061 1.0089 1.0190 1.0063 1.0091 1.0469 1.0067 1.0011 1.0295 1.0044 1.0015 1.0221 1.0257 1.0021 1.0029 0.9993 1.0074 1.0276 0.9897
dispcorr: -0.026130427 hartree
energy: -1384.997765815179
dipole: -32.21389 30.48484 -1.72905 10.06006 -10.02133 0.03873 13.28105 -11.32958 1.95147
magnitude: 2.60755 au
magnitude: 6.62788 debye
