program: Gaussian 09
title: 000064334
version: EM64L-G09RevD.01
frameworkgroup: C1[X(C19H32N2)]
method: RPBEPBE
basis: SDD
operation: Freq
keyword: #pfreq=noraman
keyword: PBEPBE/SDD
title: #p freq=noraman PBEPBE/SDD
converged: YES YES NO NO
title: Mulliken charges:
elementType: N N C C C C C C C C C C C C C C C C C C C H H H H H H H H H H H H H H H H H H H H H H H H H H H H H H H H
charge: -0.158061 -0.082332 0.468255 -0.095520 -0.090724 -0.089812 -0.557596 -0.530316 -0.540942 -0.454777 -0.449328 -0.453349 -0.383133 -0.391610 -0.381488 -0.377657 0.036239 -0.494710 -0.495475 -0.436389 -0.437753 0.193064 0.191259 0.192770 0.196569 0.217612 0.208581 0.206390 0.216736 0.191283 0.195404 0.190911 0.194548 0.191942 0.194804 0.190478 0.182104 0.196232 0.207445 0.177016 0.179007 0.209538 0.210895 0.177297 0.180321 0.210286 0.220359 0.221171 0.209635 0.206848 0.214598 0.214579 0.206796
chargesum: 0.00000
title: Mulliken charges with hydrogens summed into heavy atoms:
elementType: N N C C C C C C C C C C C C C C C C C C C
charge: -0.158061 -0.082332 0.468255 0.097545 0.100534 0.102958 -0.143415 -0.115346 -0.132923 -0.068461 -0.062838 -0.068068 -0.004796 -0.007149 0.007057 0.010535 0.216561 -0.064065 -0.064670 -0.014943 -0.016378
polarizability: 2.61343973e+02 6.14468351e-03 1.86515000e+02 -8.07159068e-01 7.89523187e-02 1.69608344e+02
1716.lowfreq: -51.7467 -10.1989 -0.0007 -0.0003 0.0006 11.0919 25.8318 29.2860 38.5059
frequency: -51.6985 26.1856 37.1240 69.2186 95.2716 98.4071 164.2926 171.4060 183.5053 228.4729 234.2874 284.0149 298.3649 315.2620 359.1881 375.6840 379.0762 395.8196 398.2494 412.6063 417.3551 442.2577 445.4313 455.7102 478.7227 482.9089 591.5757 622.6212 638.3219 639.4621 649.0767 693.1714 753.6703 763.2760 797.3805 809.0756 812.5948 814.5437 818.7897 851.3565 870.6582 871.9853 878.9973 880.9789 901.6797 938.6169 941.6634 947.4296 950.0074 956.1287 969.3668 975.0647 975.6483 977.3931 985.1064 1016.9074 1043.6238 1043.9954 1047.8296 1050.5994 1056.6594 1075.6322 1095.3820 1099.7963 1100.9802 1105.9446 1106.5964 1108.6295 1113.1565 1129.2157 1137.8179 1148.2978 1169.8980 1176.6609 1178.1807 1187.9530 1191.3530 1205.1114 1212.6372 1233.7910 1256.9234 1268.4875 1269.8061 1273.8717 1277.3994 1278.2694 1278.4743 1287.6862 1294.2282 1295.4338 1295.6362 1303.0108 1305.4360 1314.6129 1314.9220 1318.8301 1325.2899 1341.7118 1342.6953 1344.9783 1350.4015 1351.9592 1355.5485 1358.6021 1368.2645 1380.5991 1393.1401 1450.3559 1453.7456 1454.5187 1456.0660 1460.0673 1464.9296 1466.2202 1467.6134 1469.0968 1470.4012 1473.8320 1477.2077 1489.7744 1493.1069 2806.0308 2842.9167 2854.6083 2866.6776 2877.6418 2959.5137 2961.6647 2962.7756 2964.9728 2972.9300 2978.4678 2987.4335 2988.5647 2992.1060 2992.5652 2994.2637 3004.4117 3011.1255 3016.4315 3019.4032 3024.4479 3027.4572 3036.8894 3039.2976 3042.3397 3046.3256 3048.3373 3057.9503 3062.8281 3063.8972 3070.1827 3079.1054
redmass: 1.6239 3.7929 2.9168 2.9691 3.0673 3.1846 2.9175 3.1554 4.3930 2.4686 2.0232 2.2169 2.0788 2.1433 2.5331 2.8090 2.5605 4.0742 4.4906 2.4364 2.0216 2.3151 1.9867 1.9222 1.9899 2.9267 4.3207 2.8357 3.7146 3.7887 2.3581 3.3752 1.4313 3.3052 3.2490 2.6388 1.5544 2.7164 3.0736 1.5566 1.5916 1.6114 2.0357 2.1904 2.4566 2.0461 2.3501 1.9344 2.5986 1.6295 2.2066 1.4986 2.2062 2.0931 1.8835 2.6780 1.9330 1.7816 2.8582 1.7405 1.7633 2.6041 2.3011 1.4604 1.1959 2.0676 1.4656 1.2454 1.0613 2.7948 3.9141 2.3442 1.8379 1.4715 1.4703 1.2856 1.3573 1.1833 1.4178 1.1970 1.5862 1.4479 1.3297 1.3630 1.3000 1.6881 1.6999 1.9969 1.5003 1.8704 1.4665 1.3455 1.5361 1.3942 1.4385 1.4685 1.3154 1.4432 1.4352 1.5705 1.4531 1.3968 1.2723 1.6197 1.5317 1.4411 1.3775 1.0815 1.0828 1.0788 1.0830 1.0949 1.0942 1.0769 1.0950 1.0874 1.1011 1.0864 1.0824 1.0893 1.1003 1.0806 1.0708 1.0697 1.0709 1.0695 1.0654 1.0615 1.0626 1.0595 1.0619 1.0633 1.0588 1.0806 1.0598 1.0794 1.0631 1.0807 1.0663 1.1030 1.1029 1.1022 1.1021 1.1017 1.0994 1.1013 1.0884 1.0902 1.0994 1.0934 1.0956 1.0868 1.1046
irintensity: 0.0041 0.2001 0.0642 0.0174 0.0164 0.0050 0.9076 0.2084 0.0175 0.4754 1.0531 0.4358 0.1031 6.4027 1.3486 0.1837 1.7568 0.0338 0.0427 0.0323 1.3997 0.1456 1.0910 1.2801 1.9802 0.0030 0.7750 0.4463 0.2629 0.0492 0.9621 1.3129 11.7837 3.2984 0.2373 0.8652 1.8506 10.6343 2.5492 0.0556 0.0380 0.0975 1.7903 2.2363 9.3488 3.1901 2.5480 3.3466 30.4955 9.6365 4.1239 2.1970 2.5803 2.4650 0.3361 34.5978 6.4923 0.3054 5.2031 0.2251 0.2325 0.4136 2.5090 10.5035 1.7340 0.4577 3.7649 0.9949 0.0865 25.3889 29.5072 60.2817 3.6458 1.4708 17.1991 6.9658 0.4301 0.1369 0.6007 2.9210 2.5720 13.0208 8.4169 0.1425 4.0888 2.5807 10.5965 7.7253 0.0960 25.7000 6.9282 1.9698 2.4073 1.5914 1.5159 8.6683 0.3808 2.6923 0.7771 42.7087 12.9943 3.0417 0.2391 0.6046 5.6893 3.7965 0.1285 0.0181 3.0886 0.6359 2.4956 12.2915 11.2613 0.0134 15.3997 10.1158 9.5822 7.1285 12.8544 1.1881 3.0060 65.3984 63.9387 55.7714 35.1270 167.8448 10.1917 24.2512 27.1330 14.0204 13.5096 82.7737 4.6314 172.7663 54.1128 156.2558 62.4528 44.0454 58.0976 1.2769 13.1001 31.3660 107.6128 30.1541 9.8376 67.8729 34.2278 28.7391 8.1869 6.1130 75.1986 25.8710 102.8851
temp: 298.150 k
press: 1.00000 atm
elementType: 7 7 6 6 6 6 6 6 6 6 6 6 6 6 6 6 6 6 6 6 6 1 1 1 1 1 1 1 1 1 1 1 1 1 1 1 1 1 1 1 1 1 1 1 1 1 1 1 1 1 1 1 1
symmnumber: 1
zpe: 1263901.5 jmol-1
zpe.correction: 0.481395 hartree
zpe.thermalcorrener: 0.498998 hartree
zpe.thermalcorrenthalpy: 0.499942 hartree
zpe.thermalcorrgfe: 0.436210 hartree
zpe.sumelectzpe: -851.043871 hartree
zpe.sumelectthermal: -851.026268 hartree
zpe.sumelectthermalent: -851.025324 hartree
zpe.sumelectthermalfe: -851.089056 hartree
dipole: 0.2840 0.0287 -0.0281
dipole: 0.2868
quadrupole: -126.1223 -126.9605 -131.7525
quadrupole: 0.0394 1.8037 0.0271
quadrupole: 2.1561 1.3180 -3.4741 0.0394 1.8037 0.0271
hfenergy: -851.5252653 hartree
pointgroup: C01 [X(C19H32N2)]
dipole: -0.1118608 -0.010718 -0.0101766 debye
polarizability: 261.3499098|-0.0520744|186.4857813|-0.3212371|0.7074739|169.6316264 unknown
InChI: InChI=1S/C19H32N2/c1-2-4-18(3-1)20-5-7-21(8-6-20)19-12-15-9-16(13-19)11-17(10-15)14-19/h15-18H,1-14H2
charge 0 multiplicity 1
53 atoms
N  -0.284068 -0.000772 -0.346621
N  2.628528 -0.003839 0.050939
C  -1.774598 -0.001959 -0.087991
C  -3.954559 -1.29477 -0.494968
C  -3.692973 0.087547 1.611822
C  -3.964325 1.222234 -0.640073
C  -2.411554 -1.298542 -0.673296
C  -2.148563 0.084344 1.429368
C  -2.422507 1.209353 -0.827907
C  -4.291515 -1.215832 1.018818
C  -4.570438 -0.076737 -1.229252
C  -4.298552 1.312173 0.873599
C  0.445934 1.185353 0.173906
C  0.451054 -1.222787 0.070421
C  1.889721 1.217878 -0.357484
C  1.898887 -1.194758 -0.452561
C  4.054645 0.018498 -0.370989
C  4.851887 1.199988 0.243113
C  4.856871 -1.215456 0.120548
C  6.345454 0.782614 0.12648
C  6.347998 -0.78251 0.038683
H  -4.36455 -2.233297 -0.918558
H  -3.933427 0.148881 2.692342
H  -4.383032 2.103134 -1.166313
H  -2.012158 -2.192611 -0.157621
H  -2.136981 -1.379989 -1.743771
H  -1.724285 1.007261 1.871623
H  -1.707423 -0.77353 1.97576
H  -2.155058 1.149373 -1.901027
H  -2.016018 2.163449 -0.441055
H  -5.390331 -1.230884 1.164952
H  -3.878595 -2.099085 1.546989
H  -4.357515 -0.137874 -2.31531
H  -5.672565 -0.075228 -1.108524
H  -5.397318 1.338115 1.019159
H  -3.890364 2.251745 1.298208
H  0.493841 1.191839 1.291079
H  -0.062961 2.108023 -0.151259
H  -0.039544 -2.114735 -0.351514
H  0.485735 -1.337381 1.183007
H  1.861331 1.323653 -1.472811
H  2.399638 2.103938 0.059497
H  2.415061 -2.107252 -0.106419
H  1.873891 -1.212217 -1.57313
H  4.134303 0.07453 -1.491568
H  4.548986 1.293929 1.304274
H  4.655596 2.166954 -0.252841
H  4.661696 -2.12882 -0.468703
H  4.559817 -1.415923 1.168646
H  6.931336 1.150092 0.987817
H  6.802179 1.219669 -0.780656
H  6.795858 -1.113249 -0.916656
H  6.943528 -1.242733 0.847228
