program: Gaussian 09
title: 000064338
version: EM64L-G09RevD.01
frameworkgroup: C1[X(C17H30N2)]
method: RPBEPBE
basis: SDD
operation: Freq
keyword: #pfreq=noraman
keyword: PBEPBE/SDD
title: #p freq=noraman PBEPBE/SDD
converged: YES YES NO NO
title: Mulliken charges:
elementType: N N C C C C C C C C C C C C C C C C C H H H H H H H H H H H H H H H H H H H H H H H H H H H H H H
charge: -0.162807 -0.067733 0.464910 -0.090449 -0.089230 -0.095017 -0.542264 -0.529540 -0.554481 -0.453108 -0.448742 -0.453328 -0.376946 -0.375544 -0.389051 -0.378216 -0.292134 -0.384442 -0.687834 0.192886 0.191376 0.193242 0.190502 0.217724 0.206079 0.207732 0.217814 0.193982 0.195458 0.189879 0.194128 0.192213 0.195368 0.190487 0.179654 0.205412 0.196949 0.182800 0.180668 0.201254 0.197788 0.179767 0.164876 0.196324 0.214185 0.202243 0.208221 0.208447 0.218495
chargesum: 0.00000
title: Mulliken charges with hydrogens summed into heavy atoms:
elementType: N N C C C C C C C C C C C C C C C C C
charge: -0.162807 -0.067733 0.464910 0.102437 0.102146 0.098225 -0.134038 -0.115728 -0.142686 -0.067771 -0.062402 -0.067472 0.008120 0.004205 -0.007128 -0.000661 0.069067 0.031986 -0.052672
polarizability: 2.35472009e+02 -1.51995818e-01 1.68635667e+02 1.39835600e-01 2.69267885e-01 1.57106800e+02
1716.lowfreq: -15.2325 -14.1469 -2.9257 -0.0005 -0.0004 0.0008 20.0700 34.8623 55.7347
frequency: 16.7341 34.8480 55.6817 74.8507 99.2561 148.8232 178.4115 206.3707 227.3787 232.4542 245.0694 278.9191 295.0647 317.4320 334.0024 364.6684 378.4863 391.0841 395.4593 406.8584 418.8492 437.7011 442.1556 450.8388 484.4938 552.6122 633.0844 636.7655 643.3213 691.5153 754.3228 760.0998 775.2696 804.1061 808.5404 814.2512 849.1413 868.3766 870.7902 877.1228 879.7583 897.6284 938.5399 942.3961 950.7799 951.5530 967.0300 974.4891 975.9123 1008.7575 1042.5646 1042.9259 1044.7461 1048.7668 1051.3778 1055.9501 1087.5590 1098.8625 1100.0564 1104.2733 1106.4487 1109.8212 1112.0821 1121.1486 1132.1580 1138.8512 1145.4065 1177.0303 1185.8912 1191.5041 1203.5491 1245.9847 1253.8967 1262.5320 1274.5441 1276.8503 1278.7047 1285.4986 1290.6713 1295.0772 1298.9261 1302.8433 1307.9562 1314.6386 1316.5042 1324.4779 1340.9882 1341.7903 1344.7128 1347.1370 1349.7590 1357.1056 1366.5829 1367.7551 1377.5773 1387.1236 1395.9454 1449.0211 1451.6692 1452.4169 1454.9391 1458.3525 1462.2521 1464.0579 1466.9337 1469.0034 1471.2629 1477.3032 1479.5459 1486.2747 1488.9624 2822.5204 2843.1299 2856.1753 2869.9322 2878.2660 2959.2163 2961.4416 2962.4253 2964.0934 2970.2181 2972.6356 2975.5492 2987.4976 2988.3268 2991.8497 2998.7603 3004.1359 3015.9862 3017.1834 3019.5652 3022.3206 3027.5288 3033.6605 3038.4301 3039.2038 3042.3123 3068.3559 3071.9169 3074.5563 3075.1989
redmass: 2.6976 3.6916 1.6569 3.3093 3.4499 2.9790 3.1216 3.7825 1.4812 1.4352 2.1636 2.1989 2.0278 2.1668 2.7242 2.3576 2.6844 3.1890 4.4641 2.6331 1.9692 2.1000 2.2212 1.9055 2.8174 3.5598 3.7753 3.7849 2.4760 3.3893 1.0970 4.2641 3.4022 3.2079 2.6992 2.7372 1.5584 1.5859 1.5972 1.5514 1.2308 1.8988 2.0326 2.2393 2.6460 2.0316 2.2023 2.4228 2.0635 2.6466 2.3122 2.2370 1.9316 1.7180 2.5223 1.7689 2.1972 1.1449 1.3513 1.4864 1.7963 1.2633 1.0745 2.2835 3.0704 2.5564 2.8575 1.3794 1.2531 1.3558 1.4030 1.2702 1.5574 1.3521 1.3640 1.8574 1.7713 1.9996 1.7655 1.7621 1.2651 1.5658 1.5698 1.3539 1.4477 1.3140 1.4431 1.3734 1.4255 1.3326 1.4427 1.6157 1.5216 1.4491 1.3807 1.2850 1.3553 1.0806 1.0806 1.0829 1.0832 1.0924 1.0907 1.0910 1.0891 1.0887 1.0892 1.0610 1.0433 1.0902 1.0879 1.0707 1.0705 1.0692 1.0711 1.0692 1.0653 1.0612 1.0616 1.0603 1.0612 1.0357 1.0617 1.0637 1.0814 1.0810 1.0829 1.0812 1.1029 1.0892 1.1029 1.1026 1.1021 1.1024 1.0950 1.1017 1.0938 1.0865 1.1014 1.0990 1.0868
irintensity: 0.0170 0.2479 0.0623 0.1131 0.0159 0.4463 1.4742 0.3928 0.4370 0.6875 0.3226 0.8050 0.1215 5.2349 1.2455 2.3714 1.7419 2.2296 0.4293 0.3180 0.3077 0.0357 1.0610 0.9612 0.0418 0.9020 0.2987 0.0696 1.6033 1.5241 6.6326 0.8150 9.3787 9.7958 1.2406 2.5799 0.2178 0.0462 0.0513 0.0274 3.3830 1.9305 2.1580 5.7601 26.4774 6.7596 2.9631 2.3853 1.2619 47.2608 7.3120 3.1396 2.7379 0.0717 0.4959 0.6247 0.9539 3.8471 10.0099 9.8409 7.4218 2.2164 0.4332 30.1187 14.0656 10.0761 72.4374 1.9580 5.3178 0.3475 0.5271 3.1257 2.5177 11.9705 9.2895 4.9553 5.0768 4.9913 0.6604 22.1266 17.0261 2.5844 6.4191 3.3275 9.1691 0.2601 2.1886 3.1271 10.8936 3.7106 10.6839 0.7772 2.4483 3.6658 4.2938 10.1984 6.9555 0.2203 0.3836 1.9627 6.7284 11.0199 4.8916 10.1155 9.0404 18.9688 5.1441 5.1921 10.9106 0.8642 14.9237 73.2614 67.3887 72.1982 12.1807 197.2955 9.3232 25.7547 33.6537 6.5892 4.4054 51.1528 85.8222 9.8923 172.3842 163.4947 32.4666 42.3943 0.2573 53.1193 11.7488 30.8345 110.3678 32.0310 43.3112 53.0359 19.1325 40.0071 94.9231 55.9214 21.5469
temp: 298.150 k
press: 1.00000 atm
elementType: 7 7 6 6 6 6 6 6 6 6 6 6 6 6 6 6 6 6 6 1 1 1 1 1 1 1 1 1 1 1 1 1 1 1 1 1 1 1 1 1 1 1 1 1 1 1 1 1 1
symmnumber: 1
zpe: 1168948.9 jmol-1
zpe.correction: 0.445229 hartree
zpe.thermalcorrener: 0.462878 hartree
zpe.thermalcorrenthalpy: 0.463822 hartree
zpe.thermalcorrgfe: 0.399445 hartree
zpe.sumelectzpe: -773.773937 hartree
zpe.sumelectthermal: -773.756288 hartree
zpe.sumelectthermalent: -773.755344 hartree
zpe.sumelectthermalfe: -773.819720 hartree
dipole: -0.4084 -0.0140 -0.1006
dipole: 0.4209
quadrupole: -115.6234 -115.0718 -120.9324
quadrupole: -0.0253 -1.7870 0.4137
quadrupole: 1.5858 2.1374 -3.7232 -0.0253 -1.7870 0.4137
hfenergy: -774.2191656 hartree
pointgroup: C01 [X(C17H30N2)]
dipole: 0.1612162 -0.0058823 0.0373122 debye
polarizability: 235.4608815|0.295425|168.642605|-0.903096|-0.0650575|157.1109895 unknown
InChI: InChI=1S/C17H30N2/c1-2-3-18-4-6-19(7-5-18)17-11-14-8-15(12-17)10-16(9-14)13-17/h14-16H,2-13H2,1H3
charge 0 multiplicity 1
49 atoms
N  -0.294122 0.141327 0.239192
N  -3.194062 0.276072 -0.15072
C  1.199893 0.03141 0.045611
C  3.277546 -1.276068 0.798032
C  3.18123 -0.310614 -1.545038
C  3.439264 1.217431 0.461272
C  1.734742 -1.154981 0.906167
C  1.633869 -0.19729 -1.441947
C  1.893826 1.329217 0.561914
C  3.670316 -1.508799 -0.686927
C  3.940228 0.025673 1.315755
C  3.836945 0.996533 -1.023679
C  -0.950609 1.354763 -0.312632
C  -1.08729 -1.045875 -0.172702
C  -2.391145 1.467928 0.218122
C  -2.52725 -0.946416 0.360689
C  -4.603408 0.404043 0.295825
C  -5.549828 -0.642489 -0.328312
C  -7.020881 -0.3974 0.072286
H  3.614572 -2.136201 1.41031
H  3.466266 -0.471602 -2.604266
H  3.890633 2.159637 0.831011
H  1.288195 -2.110493 0.570831
H  1.422198 -0.995623 1.95663
H  1.274144 0.642121 -2.070542
H  1.168375 -1.123589 -1.833787
H  1.5775 1.510559 1.60824
H  1.57611 2.203806 -0.037713
H  4.769709 -1.618515 -0.777785
H  3.215263 -2.450328 -1.055996
H  3.681314 0.185761 2.381781
H  5.044225 -0.053169 1.252933
H  4.939756 0.932421 -1.117559
H  3.505722 1.85841 -1.637866
H  -0.987957 1.344672 -1.43068
H  -0.401946 2.255884 0.004926
H  -0.6321 -1.962292 0.237066
H  -1.138896 -1.151882 -1.284577
H  -2.346259 1.604766 1.329543
H  -2.871369 2.364405 -0.219243
H  -3.092281 -1.835405 0.027263
H  -2.496847 -0.95225 1.481314
H  -4.685378 0.353219 1.415095
H  -4.953289 1.412915 -0.00173
H  -5.43818 -0.601623 -1.428544
H  -5.254771 -1.662563 -0.014463
H  -7.148039 -0.438342 1.170938
H  -7.367359 0.596705 -0.268655
H  -7.688577 -1.157369 -0.372583
