program: Gaussian 09
title: 000064340
version: EM64L-G09RevD.01
frameworkgroup: C1[X(C12H20N2O3S2)]
method: RPBEPBE
basis: SDD
operation: Freq
keyword: #p
keyword: freq=noraman
keyword: PBEPBE/SDD
title: #p freq=noraman PBEPBE/SDD
converged: YES YES NO NO
title: Mulliken charges:
elementType: S S O O O N N C C C C C C C C C C C C H H H H H H H H H H H H H H H H H H H H
charge: 0.030908 1.001425 -0.551869 -0.477178 -0.533776 -0.063697 -0.623999 0.261465 -0.087916 -0.086902 -0.088991 -0.513797 -0.525684 -0.508028 -0.453964 -0.452695 -0.453519 0.256675 -0.861650 0.201161 0.202445 0.203699 0.218521 0.187020 0.219192 0.215873 0.182519 0.226312 0.198795 0.197938 0.188176 0.203814 0.198841 0.199583 0.345570 0.308373 0.328306 0.331384 0.375669
chargesum: 0.00000
title: Mulliken charges with hydrogens summed into heavy atoms:
elementType: S S O O O N N C C C C C C C C C C C C
charge: 0.030908 1.001425 -0.176200 -0.477178 -0.533776 -0.063697 0.035691 0.261465 0.113245 0.115543 0.114709 -0.108256 -0.090619 -0.099197 -0.057232 -0.060705 -0.055094 0.256675 -0.207707
polarizability: 4.66968460e+02 -7.20182323e+00 1.67455785e+02 -9.67057258e+00 -1.90098711e+00 1.68968538e+02
1716.lowfreq: -40.7346 -33.7553 -6.8246 -0.1687 -0.0009 0.0005 0.0017 16.2564 19.6885
frequency: -34.7883 -15.6490 15.5991 36.0087 66.7124 74.5924 91.4822 104.8854 144.9419 158.8181 210.3554 226.4516 257.1066 265.8917 275.0801 282.3930 290.0285 298.7306 347.1615 381.8758 390.2787 395.6109 401.5342 417.5802 430.6695 441.0772 466.4566 526.6184 530.9200 561.3622 596.9090 618.7891 634.9601 636.1629 689.5567 734.2923 767.8536 800.7331 805.4432 810.1222 838.2623 866.0337 868.9646 870.3664 871.1564 911.1746 920.3994 933.2553 940.0147 964.0015 966.2905 973.3711 1030.2085 1034.7037 1046.3305 1048.0861 1056.8070 1096.2909 1100.4497 1101.6814 1103.0421 1113.1412 1121.5704 1171.6971 1179.6745 1182.8229 1241.6419 1251.3753 1259.2325 1276.7186 1280.1873 1286.1163 1292.1263 1305.4728 1309.1400 1320.2839 1324.8432 1339.0601 1341.2385 1348.4570 1356.0416 1360.4381 1402.6782 1449.8405 1451.9576 1462.8576 1464.1460 1466.7884 1485.4143 1592.1121 1659.6649 2878.1686 2962.9079 2964.8580 2968.2291 2970.2356 2976.5720 2984.7735 2995.1946 2999.5757 3010.8512 3021.8343 3025.8432 3031.8043 3033.3966 3037.9925 3049.1360 3090.3176 3463.5947 3466.8314 3664.0804
redmass: 1.5920 3.9684 8.7013 5.2355 4.1657 5.5431 5.1921 9.4681 7.8788 3.8918 4.2722 12.1587 4.4301 3.4105 4.5095 3.0651 2.0287 7.3216 2.3250 3.1065 4.7442 4.0952 11.1741 1.7206 1.9210 1.9121 1.1835 2.8247 10.7160 1.8107 3.9761 1.8696 3.9602 3.6517 4.4605 6.3507 3.7529 2.8199 3.0979 8.7068 4.3954 1.5798 1.5912 1.7333 1.6205 2.9792 4.7732 2.0904 2.0859 2.2292 2.2254 2.2097 2.9588 1.9724 1.8201 1.7569 1.3575 1.6153 1.3671 1.2388 1.1065 1.0157 2.2195 1.2086 1.2070 1.1725 1.4991 1.5727 1.5633 1.7593 1.8231 1.8835 2.0562 1.7121 1.7193 1.9090 1.3166 1.4656 1.4573 1.4633 1.5924 1.5432 1.0774 1.0841 1.0832 1.0908 1.0895 1.0950 1.0909 1.2088 7.0737 1.0699 1.0630 1.0626 1.0622 1.0615 1.0610 1.0634 1.0825 1.0820 1.0827 1.1016 1.1028 1.1009 1.1019 1.1011 1.1024 1.0884 1.0660 1.0519 1.0964
irintensity: 59.5741 10.7416 3.8557 8.8178 4.3721 6.0028 1.8462 13.0189 16.2260 0.9958 1.0891 34.4592 18.4535 11.7841 6.3886 5.9982 0.4189 10.1478 3.2192 6.9561 0.2230 2.1869 59.2557 1.2412 0.4402 10.6482 53.8317 48.3234 274.9060 82.9785 110.1041 41.0845 1.5354 10.0499 2.3586 6.6763 1.1592 10.1304 32.3133 46.9287 25.6828 0.0465 0.0877 2.7263 0.8718 1.5694 76.6350 13.5362 19.3064 23.1549 5.2315 1.6986 6.6843 11.2425 5.8741 0.1791 63.8018 15.3363 6.2859 11.9111 3.4439 0.0403 42.7362 17.1079 41.3825 30.1228 29.0942 22.8107 12.3640 15.5522 7.1524 1.8679 58.9656 20.0336 9.8839 8.6189 0.0070 6.6905 2.9033 0.1022 2.7046 9.9665 14.3596 1.2071 0.3132 19.5382 17.7703 24.3009 0.3845 92.3696 174.7603 5.9306 27.3455 11.5350 27.5015 28.7552 17.1181 34.9318 133.4305 145.4320 76.0597 11.7352 6.7952 38.9717 91.6189 56.0086 47.3121 9.6625 130.7594 7.1005 46.1212
temp: 298.150 k
press: 1.00000 atm
elementType: 16 16 8 8 8 7 7 6 6 6 6 6 6 6 6 6 6 6 6 1 1 1 1 1 1 1 1 1 1 1 1 1 1 1 1 1 1 1 1
symmnumber: 1
zpe: 821947.4 jmol-1
zpe.correction: 0.313063 hartree
zpe.thermalcorrener: 0.331426 hartree
zpe.thermalcorrenthalpy: 0.332370 hartree
zpe.thermalcorrgfe: 0.265655 hartree
zpe.sumelectzpe: -1598.921450 hartree
zpe.sumelectthermal: -1598.903087 hartree
zpe.sumelectthermalent: -1598.902143 hartree
zpe.sumelectthermalfe: -1598.968858 hartree
dipole: 6.3188 -1.0340 -0.5028
dipole: 6.4226
quadrupole: -150.4922 -133.0645 -124.9731
quadrupole: 0.8082 15.6427 -3.1512
quadrupole: -14.3156 3.1121 11.2035 0.8082 15.6427 -3.1512
hfenergy: -1599.2345132 hartree
pointgroup: C01[X(C12H20N2O3S2)]
dipole: -2.4508758 0.4772351 0.3878248 debye
polarizability: 463.4221822|-33.1259752|171.2239557|-9.9778708|-1.0910822|168.746645 unknown
InChI: InChI=1S/C12H19N2S.HO3S/c13-11(7-15)14-12-4-8-1-9(5-12)3-10(2-8)6-12;1-4(2)3/h8-10H,1-7,13H2;1H
charge 0 multiplicity 1
39 atoms
S  3.685958 0.204268 1.432922
S  5.199491 -0.804002 -0.388158
O  6.757697 0.216101 -0.430207
O  5.69956 -2.297562 -0.059495
O  4.401997 -0.486163 -1.781199
N  -0.018858 0.653507 -0.054145
N  1.040356 -1.239702 1.056711
C  -1.461626 0.325127 0.014958
C  -3.50835 -0.117917 1.472241
C  -3.750119 1.269089 -0.633225
C  -3.321409 -1.220356 -0.806297
C  -1.976635 0.148738 1.477353
C  -2.221214 1.520932 -0.630757
C  -1.78856 -0.962486 -0.814324
C  -4.245351 1.086045 0.826698
C  -3.807222 -1.405858 0.656735
C  -4.058018 -0.015299 -1.449609
C  0.990631 -0.005033 0.435786
C  2.350448 0.690365 0.236451
H  -3.853454 -0.25073 2.51661
H  -4.261583 2.135746 -1.095469
H  -3.529794 -2.140019 -1.388396
H  -1.747377 1.067426 2.051883
H  -1.458339 -0.688103 1.986549
H  -1.841623 1.662817 -1.660613
H  -1.974221 2.440561 -0.066374
H  -1.26268 -1.845086 -0.396142
H  -1.419523 -0.826962 -1.84904
H  -5.339609 0.911367 0.839873
H  -4.053264 2.007398 1.412028
H  -3.301678 -2.277828 1.120253
H  -4.894762 -1.617023 0.669658
H  -5.149716 -0.205142 -1.465826
H  -3.731649 0.113507 -2.50071
H  2.726158 0.419861 -0.78019
H  2.202227 1.781296 0.255261
H  0.212684 -1.818053 1.171349
H  1.94122 -1.573091 1.411213
H  6.614008 0.922966 -1.127155
