program: Gaussian 09
title: 000064245
version: EM64L-G09RevD.01
frameworkgroup: C1[X(C12H21N)]
method: RPBEPBE
basis: SDD
operation: Freq
keyword: #pfreq=noraman
keyword: PBEPBE/SDD
title: #p freq=noraman PBEPBE/SDD
converged: NO YES NO NO
title: Mulliken charges:
elementType: N C C C C C C C C C C C C H H H H H H H H H H H H H H H H H H H H H
charge: -0.567066 0.473926 -0.103791 -0.106882 -0.100293 -0.542229 -0.542745 -0.528261 -0.451364 -0.449461 -0.449757 -0.462247 -0.434780 0.192584 0.193115 0.192418 0.198290 0.194651 0.201025 0.199211 0.196690 0.199474 0.194690 0.190701 0.191013 0.194260 0.193996 0.192310 0.222175 0.179209 0.193278 0.220884 0.257208 0.267770
chargesum: 0.00000
title: Mulliken charges with hydrogens summed into heavy atoms:
elementType: N C C C C C C C C C C C C
charge: -0.042088 0.473926 0.088793 0.086234 0.092126 -0.149288 -0.142509 -0.132098 -0.065974 -0.064188 -0.063452 -0.060864 -0.020618
polarizability: 1.42372810e+02 -2.39286046e-01 1.16539147e+02 1.96099469e-01 1.18881735e+00 1.13472925e+02
1716.lowfreq: -15.7615 -0.0008 0.0005 0.0006 8.8874 36.1260 61.5470 88.0829 131.5046
frequency: 61.2849 87.6001 131.3130 232.6701 252.4713 271.6880 297.1381 306.0149 352.6037 375.6274 393.5714 395.0748 420.2590 427.3046 440.0829 592.7637 618.9595 638.5320 639.0473 707.7331 768.7225 772.6518 806.9009 812.0405 868.1884 869.8254 872.9759 901.6803 922.1254 940.8034 959.3101 967.4394 978.3685 984.4204 1022.5202 1045.0903 1048.9694 1059.1499 1087.0185 1097.9725 1099.8118 1102.3606 1107.5254 1109.5778 1130.1685 1143.0801 1180.3700 1190.2977 1224.4382 1255.1483 1270.4259 1283.4521 1286.9326 1291.6666 1304.3041 1308.1635 1310.6077 1312.7892 1323.2681 1325.0763 1342.0900 1343.6151 1352.5689 1358.4469 1363.1562 1387.8140 1446.8574 1451.3168 1454.3275 1461.1576 1461.4736 1463.9164 1479.8108 1494.0945 1637.4219 2881.9149 2937.7499 2948.4793 2951.7184 2956.5106 2958.1741 2958.9816 2959.4528 2986.6551 2987.2589 3000.2524 3002.3219 3004.9642 3009.8045 3013.2173 3018.6013 3021.7869 3023.5941 3028.2649 3443.6122 3571.2808
redmass: 1.8154 3.2694 3.2893 1.6844 1.4566 2.4493 1.9589 2.6807 2.0499 2.5650 4.2290 4.4112 1.7078 1.7154 1.7731 2.0013 1.7529 3.7492 3.8632 3.8569 3.2686 1.3665 2.4802 2.4143 1.5960 1.5864 1.5647 2.7900 1.9461 2.3053 2.0248 2.1780 1.8794 2.5524 1.9435 1.7773 1.7320 1.8095 2.2755 1.5298 1.1770 1.2687 1.2891 1.0329 1.2629 3.0726 1.2390 1.1469 1.2722 1.6273 1.5771 1.6262 1.7361 1.8411 2.1840 1.8687 1.4116 1.5361 1.3195 1.4555 1.4338 1.4592 1.4715 1.5938 1.6159 1.4379 1.0834 1.0830 1.0816 1.0911 1.0899 1.0930 1.0905 1.0850 1.0936 1.0708 1.0634 1.0598 1.0601 1.0658 1.0610 1.0607 1.0598 1.0834 1.0833 1.0831 1.0919 1.1011 1.1015 1.1022 1.1017 1.1012 1.1021 1.0950 1.0446 1.0973
irintensity: 4.6727 0.6410 0.1370 15.5948 24.8591 0.2969 0.2438 19.7754 0.1297 3.3484 0.5746 0.6026 1.2381 0.8340 0.1745 111.6644 111.9694 2.3784 0.1038 1.1008 0.6715 0.6466 1.9952 2.5517 0.0528 0.0625 0.0195 0.2206 0.0655 0.2185 3.4484 3.5936 1.8953 8.6111 0.6118 0.0873 0.0122 1.1069 6.3003 2.5060 3.4733 6.6316 8.9036 0.7001 8.1288 0.5913 0.9057 1.2114 0.8839 0.3285 0.2683 0.5217 0.8475 0.3370 3.9377 2.1096 1.9311 2.5595 0.0196 1.4029 2.1218 1.9039 3.7960 0.4839 0.0336 7.8734 0.1222 1.2156 0.1608 16.6442 19.2163 17.3021 0.1070 1.4436 40.3518 94.6691 21.8309 31.0040 32.2745 0.1328 42.3751 24.0966 80.1549 167.6002 167.0223 44.9626 8.0142 6.6739 5.8142 3.3071 46.2617 96.2650 107.3268 89.5643 2.6537 0.1470
temp: 298.150 k
press: 1.00000 atm
elementType: 7 6 6 6 6 6 6 6 6 6 6 6 6 1 1 1 1 1 1 1 1 1 1 1 1 1 1 1 1 1 1 1 1 1
symmnumber: 1
zpe: 814358.1 jmol-1
zpe.correction: 0.310173 hartree
zpe.thermalcorrener: 0.321825 hartree
zpe.thermalcorrenthalpy: 0.322770 hartree
zpe.thermalcorrgfe: 0.273445 hartree
zpe.sumelectzpe: -523.593398 hartree
zpe.sumelectthermal: -523.581745 hartree
zpe.sumelectthermalent: -523.580801 hartree
zpe.sumelectthermalfe: -523.630125 hartree
dipole: 0.0071 -0.6197 1.0920
dipole: 1.2556
quadrupole: -79.8352 -80.9013 -81.8460
quadrupole: 3.2739 -5.6953 1.5074
quadrupole: 1.0256 -0.0404 -0.9852 3.2739 -5.6953 1.5074
hfenergy: -523.9035707 hartree
pointgroup: C01 [X(C12H21N1)]
dipole: -0.0019281 0.3106728 0.384078 debye
polarizability: 142.3640904|-0.5611544|116.0843288|0.0297577|-1.6213828|113.9364625 unknown
InChI: InChI=1S/C12H21N/c13-2-1-12-6-9-3-10(7-12)5-11(4-9)8-12/h9-11H,1-8,13H2
charge 0 multiplicity 1
34 atoms
N  4.474277 -0.087274 0.015512
C  0.573502 -0.282877 0.0296
C  -1.345543 0.886871 1.259189
C  -1.318588 0.842495 -1.278098
C  -1.7945 -1.279508 0.023422
C  0.174251 0.564008 1.277132
C  0.201715 0.522052 -1.252605
C  -0.275556 -1.592875 0.043499
C  -1.68397 1.6888 -0.027456
C  -2.161126 -0.434105 1.272955
C  -2.134215 -0.478684 -1.262234
C  2.075788 -0.67825 0.050464
C  3.103685 0.470302 -0.030934
H  -1.60231 1.491957 2.151866
H  -1.556555 1.41582 -2.196525
H  -2.367262 -2.228412 0.033711
H  0.75066 1.510547 1.29554
H  0.434505 0.007132 2.201491
H  0.485865 -0.061306 -2.152833
H  0.775643 1.469983 -1.284994
H  -0.023802 -2.185605 0.947641
H  -0.006617 -2.214067 -0.835825
H  -2.762869 1.943915 -0.043308
H  -1.120099 2.643762 -0.038006
H  -1.941232 -1.007387 2.196533
H  -3.247324 -0.210636 1.277625
H  -3.219848 -0.25535 -1.297769
H  -1.895051 -1.083505 -2.160461
H  2.28621 -1.368066 -0.791805
H  2.268072 -1.255796 0.982498
H  2.899077 1.215303 0.775664
H  2.990277 0.999787 -0.995369
H  4.656139 -0.64845 0.855063
H  5.2162 0.601417 -0.146082
