program: Orca
programVersion: 5.0.2
elementType: O O O N N N N N N N C C C C C C C C C C C C C C C C C C C C H H H H H H H H H H H H H H H H H H H H H H H
charge: 0
multiplicity: 1
keywords: wb97x-d3
keywords: def2-TZVPP
keywords: def2/J RIJCOSX
keywords: DEFGRID2
keywords: scfconv7
keywords: smallprint printgap noloewdin
keywords: NOSOSCF
formula: C20H23N7O3
InChI: InChI=1/C20H23N7O3/c1-20(2,3)30-19(28)22-16-12-8-11-15(21-16)13-29-24-17(14-9-6-5-7-10-14)18-23-25-26-27(18)4/h5-12,22H,13H2,1-4H3
53 atoms
O  -3.07468 2.47876 -0.052596
O  2.911372 -0.162321 -0.333636
O  -3.132998 2.317657 -2.308104
N  -1.285029 1.763303 -1.085238
N  0.796563 1.017154 -1.536317
N  1.169468 -3.941593 0.013504
N  2.267855 -1.344501 -0.292343
N  0.442331 -3.375832 1.948364
N  0.426238 -4.932951 0.476691
N  0.00093 -4.58301 1.626731
C  -4.426907 2.996224 0.132346
C  -5.463473 1.990823 -0.349184
C  -4.524239 3.154186 1.643391
C  -4.581378 4.352874 -0.540488
C  -2.566687 2.204663 -1.244873
C  -0.374531 1.364789 -2.053121
C  1.768488 0.598315 -2.331926
C  1.839847 -1.670471 0.863252
C  1.920249 -0.856223 2.095935
C  3.077693 0.24477 -1.676117
C  -0.625528 1.323693 -3.426115
C  1.174834 -2.968082 0.936134
C  1.620568 0.510364 -3.706821
C  0.400685 0.890207 -4.245765
C  2.488025 -1.390143 3.249705
C  1.422316 0.445398 2.114335
C  2.566619 -0.62829 4.405979
C  1.489383 1.197678 3.276711
C  2.064992 0.665472 4.422661
C  1.797459 -4.048485 -1.287183
H  -5.294383 1.008533 0.095619
H  -5.483147 1.8821 -1.431596
H  -6.453893 2.324739 -0.036682
H  -3.774743 3.850684 2.023177
H  -5.505958 3.545512 1.909482
H  -4.396732 2.198991 2.155513
H  -5.530695 4.795144 -0.235499
H  -4.58354 4.292754 -1.626917
H  -3.788515 5.036757 -0.231997
H  -0.924411 1.716701 -0.141299
H  3.604148 -0.520235 -2.254358
H  3.722121 1.125144 -1.626546
H  -1.574748 1.610334 -3.846417
H  2.427254 0.15332 -4.333136
H  0.238961 0.83983 -5.314802
H  2.877211 -2.400241 3.248708
H  0.969145 0.87037 1.227415
H  3.015917 -1.050513 5.295357
H  1.09131 2.204122 3.284943
H  2.119555 1.257674 5.327128
H  2.858145 -3.827279 -1.212139
H  1.66492 -5.070137 -1.629679
H  1.333969 -3.364211 -1.99243
elementType: O N C H
totalener: -1385.00020686 hartree
nucrepener: 2875.54673997 hartree
electener: -4260.54694683 hartree
oneelecener: -7601.18002893 hartree
twoeener: 3340.63308210 hartree
cpcmener: -0.04169050 hartree
kineticenergy: 1379.23544340 hartree
xcener: -132.288030628862 hartree
chargesum: 0.0000000
charge: -0.336081 -0.207550 -0.502222 -0.161456 -0.411041 0.102193 -0.164225 -0.212299 -0.171433 -0.133250 0.271728 -0.313185 -0.279844 -0.315670 0.521789 0.308210 0.164057 0.282047 0.057398 0.033528 -0.231355 0.074627 -0.216590 -0.101095 -0.228438 -0.174177 -0.145564 -0.172113 -0.141092 -0.123041 0.103969 0.103611 0.102881 0.102051 0.093970 0.103004 0.103379 0.104995 0.103155 0.185167 0.115243 0.116830 0.157740 0.148353 0.159192 0.147734 0.133322 0.156891 0.154810 0.158471 0.125134 0.124922 0.121320
qa: -0.3361 -0.2076 -0.5022 -0.1615 -0.4110 0.1022 -0.1642 -0.2123 -0.1714 -0.1333 0.2717 -0.3132 -0.2798 -0.3157 0.5218 0.3082 0.1641 0.2820 0.0574 0.0335 -0.2314 0.0746 -0.2166 -0.1011 -0.2284 -0.1742 -0.1456 -0.1721 -0.1411 -0.1230 0.1040 0.1036 0.1029 0.1021 0.0940 0.1030 0.1034 0.1050 0.1032 0.1852 0.1152 0.1168 0.1577 0.1484 0.1592 0.1477 0.1333 0.1569 0.1548 0.1585 0.1251 0.1249 0.1213
va: 2.1132 2.0050 2.0067 3.1863 3.0187 3.3977 2.8612 2.9844 2.8103 2.8492 3.8041 3.9049 3.9124 3.9054 4.2682 4.0078 3.8025 3.6875 3.5116 3.9416 3.9355 4.2664 3.9229 3.9410 3.9990 3.9308 3.8961 3.9322 3.8998 3.8406 1.0064 1.0202 1.0031 1.0076 1.0064 1.0075 1.0031 1.0198 1.0065 1.0231 1.0053 0.9935 1.0267 0.9961 0.9922 1.0065 1.0333 0.9923 0.9943 0.9897 0.9980 1.0071 0.9957
dispcorr: -0.025792841 hartree
energy: -1385.025999705365
dipole: -19.67136 21.21408 1.54272 20.76846 -18.97925 1.78921 -1.24540 -0.24817 -1.49358
magnitude: 2.79500 au
magnitude: 7.10433 debye
