program: Orca
programVersion: 5.0.2
elementType: O O O N N N N N N N C C C C C C C C C C C C C C C C C C C C H H H H H H H H H H H H H H H H H H H H H H H
charge: 0
multiplicity: 1
keywords: wb97x-d3
keywords: def2-TZVPP
keywords: def2/J RIJCOSX
keywords: DEFGRID2
keywords: scfconv7
keywords: smallprint printgap noloewdin
keywords: NOSOSCF
formula: C20H23N7O3
InChI: InChI=1/C20H23N7O3/c1-20(2,3)30-19(28)22-16-12-8-11-15(21-16)13-29-24-17(14-9-6-5-7-10-14)18-23-25-26-27(18)4/h5-12,22H,13H2,1-4H3
53 atoms
O  -2.947516 2.302708 -0.121461
O  2.997455 -0.317956 -0.300219
O  -2.881471 2.395166 -2.381489
N  -1.090625 1.737476 -1.125494
N  0.981288 0.94856 -1.540703
N  0.629326 -3.743461 0.08228
N  2.187639 -1.392646 -0.242969
N  0.134863 -3.112822 2.069849
N  -0.237247 -4.609066 0.582309
N  -0.519253 -4.224115 1.764584
C  -4.336256 2.717298 0.047741
C  -5.280076 1.702545 -0.581681
C  -4.508153 2.712877 1.560696
C  -4.553537 4.123695 -0.491868
C  -2.371757 2.171284 -1.307029
C  -0.136123 1.419072 -2.080695
C  1.980175 0.570265 -2.320173
C  1.718422 -1.632538 0.917262
C  1.922446 -0.81515 2.134237
C  3.221609 0.043587 -1.645962
C  -0.295423 1.561391 -3.45918
C  0.857519 -2.806999 1.015414
C  1.920259 0.656298 -3.703156
C  0.76192 1.170716 -4.262804
C  1.572995 0.533643 2.138501
C  2.449947 -1.391963 3.286034
C  1.743763 1.29085 3.287174
C  2.632184 -0.627057 4.428554
C  2.276291 0.714239 4.432426
C  1.142635 -3.920369 -1.260439
H  -6.304849 1.942992 -0.29528
H  -5.068294 0.69401 -0.221899
H  -5.238534 1.698336 -1.669225
H  -3.825729 3.414409 2.043513
H  -5.525146 3.009808 1.816315
H  -4.335801 1.720547 1.980774
H  -4.500316 4.179116 -1.577191
H  -3.82684 4.821833 -0.072289
H  -5.545496 4.46803 -0.195746
H  -0.790156 1.563581 -0.175275
H  3.632905 -0.797636 -2.212491
H  3.987785 0.821066 -1.608595
H  -1.198298 1.952245 -3.897444
H  2.74745 0.329577 -4.319518
H  0.671488 1.262559 -5.337482
H  1.154787 0.991978 1.250958
H  2.723762 -2.439207 3.293826
H  1.460626 2.335454 3.286324
H  3.046016 -1.083634 5.318145
H  2.408855 1.308842 5.327205
H  0.777704 -4.875813 -1.624585
H  0.791706 -3.124501 -1.911507
H  2.22877 -3.928179 -1.250882
elementType: O N C H
totalener: -1384.99981674 hartree
nucrepener: 2894.23480038 hartree
electener: -4279.23461713 hartree
oneelecener: -7638.57934027 hartree
twoeener: 3359.34472314 hartree
cpcmener: -0.04142756 hartree
kineticenergy: 1379.23351705 hartree
xcener: -132.288265547757 hartree
chargesum: -0.0000000
charge: -0.335276 -0.212446 -0.502841 -0.164739 -0.408395 0.102952 -0.152781 -0.210801 -0.171601 -0.135282 0.269050 -0.312754 -0.280049 -0.313294 0.521517 0.310963 0.167294 0.286385 0.062707 0.029157 -0.234491 0.073207 -0.220572 -0.098921 -0.187997 -0.228284 -0.169465 -0.146983 -0.143050 -0.122465 0.103004 0.104098 0.103699 0.102359 0.093564 0.103519 0.104123 0.103028 0.102966 0.186110 0.116976 0.120658 0.155822 0.149013 0.159100 0.131908 0.148028 0.155516 0.156953 0.158317 0.124235 0.121441 0.124820
qa: -0.3353 -0.2124 -0.5028 -0.1647 -0.4084 0.1030 -0.1528 -0.2108 -0.1716 -0.1353 0.2690 -0.3128 -0.2800 -0.3133 0.5215 0.3110 0.1673 0.2864 0.0627 0.0292 -0.2345 0.0732 -0.2206 -0.0989 -0.1880 -0.2283 -0.1695 -0.1470 -0.1431 -0.1225 0.1030 0.1041 0.1037 0.1024 0.0936 0.1035 0.1041 0.1030 0.1030 0.1861 0.1170 0.1207 0.1558 0.1490 0.1591 0.1319 0.1480 0.1555 0.1570 0.1583 0.1242 0.1214 0.1248
va: 2.1129 2.0089 2.0059 3.1931 3.0094 3.3980 2.8576 2.9822 2.8105 2.8481 3.8076 3.9053 3.9120 3.9041 4.2688 3.9955 3.7933 3.6908 3.5095 3.9420 3.9440 4.2711 3.9353 3.9402 3.9379 4.0008 3.9345 3.8985 3.8992 3.8413 1.0033 1.0064 1.0199 1.0075 1.0065 1.0074 1.0205 1.0063 1.0034 1.0215 1.0046 0.9933 1.0273 0.9959 0.9918 1.0352 1.0075 0.9940 0.9922 0.9898 1.0074 0.9951 0.9979
dispcorr: -0.026005386 hartree
energy: -1385.025822127263
dipole: -19.07100 20.68868 1.61768 18.40064 -16.98638 1.41426 -2.01089 0.40706 -1.60383
magnitude: 2.68129 au
magnitude: 6.81530 debye
