program: Orca
programVersion: 5.0.2
elementType: O O O N N N N N N N C C C C C C C C C C C C C C C C C C C C H H H H H H H H H H H H H H H H H H H H H H H
charge: 0
multiplicity: 1
keywords: wb97x-d3
keywords: def2-TZVPP
keywords: def2/J RIJCOSX
keywords: DEFGRID2
keywords: scfconv7
keywords: smallprint printgap noloewdin
keywords: NOSOSCF
formula: C20H23N7O3
InChI: InChI=1/C20H23N7O3/c1-20(2,3)30-19(28)22-16-12-8-11-15(21-16)13-29-24-17(14-9-6-5-7-10-14)18-23-25-26-27(18)4/h5-12,22H,13H2,1-4H3
53 atoms
O  -4.734223 1.978265 -3.081168
O  2.443074 -0.34412 -0.450914
O  -4.481384 2.791055 -0.984846
N  -2.891608 1.506107 -2.006126
N  -0.791636 0.838789 -1.513804
N  1.236325 -3.551575 1.959126
N  2.039797 -1.427774 0.243639
N  3.188462 -3.537114 2.84445
N  1.29955 -4.54873 2.826024
N  2.464425 -4.528069 3.344363
C  -6.026375 2.588135 -3.37265
C  -5.923527 4.10668 -3.348666
C  -6.309979 2.109635 -4.789563
C  -7.09654 2.066939 -2.42436
C  -4.089443 2.158036 -1.93839
C  -1.873733 1.460156 -1.06527
C  0.273274 0.724952 -0.731824
C  2.827666 -1.760805 1.189318
C  4.08896 -1.07768 1.553589
C  1.448142 0.043191 -1.37782
C  -1.951117 1.987517 0.225444
C  2.420784 -2.922428 1.972928
C  0.310275 1.230051 0.5581
C  -0.833308 1.860204 1.027789
C  5.113992 -0.932501 0.621397
C  4.244231 -0.554183 2.834902
C  6.278998 -0.265839 0.969242
C  5.405901 0.122731 3.174366
C  6.424346 0.268478 2.242699
C  0.022568 -3.309437 1.208063
H  -5.105591 4.455796 -3.980947
H  -5.78152 4.507054 -2.347107
H  -6.846448 4.532983 -3.743156
H  -5.547673 2.456594 -5.489392
H  -6.354045 1.020385 -4.843336
H  -7.270971 2.497867 -5.126432
H  -8.074222 2.403032 -2.771564
H  -6.971631 2.424755 -1.404463
H  -7.111641 0.975713 -2.410329
H  -2.665396 1.041961 -2.875581
H  1.108922 -0.813487 -1.966782
H  1.947275 0.735391 -2.05972
H  -2.83836 2.473888 0.59403
H  1.189185 1.14774 1.181455
H  -0.854787 2.26105 2.032941
H  5.012723 -1.350298 -0.372037
H  3.454405 -0.664822 3.567097
H  7.073795 -0.161557 0.241922
H  5.514877 0.534028 4.169468
H  7.331836 0.794734 2.509548
H  0.181491 -3.505571 0.151216
H  -0.738047 -3.981962 1.591908
H  -0.303372 -2.281583 1.340242
elementType: O N C H
totalener: -1385.00245506 hartree
nucrepener: 2740.55331103 hartree
electener: -4125.55576609 hartree
oneelecener: -7330.28654648 hartree
twoeener: 3204.73078039 hartree
cpcmener: -0.03967065 hartree
kineticenergy: 1379.22711549 hartree
xcener: -132.285087656684 hartree
chargesum: 0.0000000
charge: -0.336334 -0.212234 -0.500236 -0.157589 -0.410776 0.102549 -0.157458 -0.208352 -0.171064 -0.134455 0.272162 -0.314637 -0.278167 -0.313552 0.523406 0.299903 0.157914 0.294313 0.039722 0.054377 -0.227298 0.067975 -0.216536 -0.108372 -0.176658 -0.232718 -0.165951 -0.149365 -0.139858 -0.120772 0.103621 0.105129 0.103039 0.101994 0.102202 0.093314 0.102952 0.104452 0.102925 0.169735 0.107997 0.119934 0.158456 0.144151 0.158417 0.146126 0.149712 0.156915 0.158302 0.159550 0.123032 0.125413 0.122693
qa: -0.3363 -0.2122 -0.5002 -0.1576 -0.4108 0.1025 -0.1575 -0.2084 -0.1711 -0.1345 0.2722 -0.3146 -0.2782 -0.3136 0.5234 0.2999 0.1579 0.2943 0.0397 0.0544 -0.2273 0.0680 -0.2165 -0.1084 -0.1767 -0.2327 -0.1660 -0.1494 -0.1399 -0.1208 0.1036 0.1051 0.1030 0.1020 0.1022 0.0933 0.1030 0.1045 0.1029 0.1697 0.1080 0.1199 0.1585 0.1442 0.1584 0.1461 0.1497 0.1569 0.1583 0.1595 0.1230 0.1254 0.1227
va: 2.1136 2.0086 2.0047 3.1783 3.0337 3.4006 2.8780 2.9929 2.8110 2.8524 3.8031 3.9053 3.9126 3.9059 4.2739 4.0417 3.7842 3.7085 3.5302 3.8944 3.9112 4.2697 3.9124 3.9624 3.9515 3.9878 3.9122 3.9033 3.8994 3.8420 1.0065 1.0197 1.0033 1.0074 1.0078 1.0067 1.0034 1.0200 1.0064 1.0384 1.0220 0.9944 1.0256 1.0063 0.9942 1.0124 1.0062 0.9928 0.9919 0.9894 0.9971 1.0074 0.9932
dispcorr: -0.024855593 hartree
energy: -1385.027310653005
dipole: -31.97802 30.59800 -1.38002 20.26971 -18.30568 1.96403 -20.44732 17.96789 -2.47943
magnitude: 3.45101 au
magnitude: 8.77177 debye
