program: Orca
programVersion: 5.0.2
elementType: O O O N N N N N N N C C C C C C C C C C C C C C C C C C C C H H H H H H H H H H H H H H H H H H H H H H H
charge: 0
multiplicity: 1
keywords: wb97x-d3
keywords: def2-TZVPP
keywords: def2/J RIJCOSX
keywords: DEFGRID2
keywords: scfconv7
keywords: smallprint printgap noloewdin
keywords: NOSOSCF
formula: C20H23N7O3
InChI: InChI=1/C20H23N7O3/c1-20(2,3)30-19(28)22-16-12-8-11-15(21-16)13-29-24-17(14-9-6-5-7-10-14)18-23-25-26-27(18)4/h5-12,22H,13H2,1-4H3
53 atoms
O  -5.327189 2.458044 -1.176936
O  1.741823 0.223416 1.824964
O  -3.87625 2.254162 -2.89911
N  -3.282176 1.819813 -0.735798
N  -1.363188 1.295119 0.337346
N  1.577369 -3.822043 0.754683
N  1.631834 -1.092398 1.553964
N  3.679441 -3.949775 1.151966
N  1.951323 -5.077519 0.575327
N  3.202816 -5.139112 0.813956
C  -6.467694 2.942208 -1.946556
C  -6.151474 4.285831 -2.588735
C  -6.918112 1.906768 -2.967446
C  -7.540933 3.118501 -0.8815
C  -4.150714 2.189305 -1.722465
C  -1.932485 1.515604 -0.839833
C  -0.068345 1.013149 0.399231
C  2.747134 -1.695338 1.420957
C  4.09114 -1.088538 1.544728
C  0.465563 0.833087 1.794487
C  -1.221643 1.437506 -2.039566
C  2.66124 -3.119962 1.117385
C  0.733217 0.932313 -0.728469
C  0.125637 1.142644 -1.957945
C  4.475356 -0.448334 2.720599
C  4.976718 -1.14637 0.471202
C  5.732858 0.127728 2.818103
C  6.228795 -0.558637 0.569115
C  6.609327 0.078064 1.742636
C  0.199549 -3.430524 0.542952
H  -7.069813 4.710184 -2.996706
H  -5.436023 4.211613 -3.40529
H  -5.764531 4.991574 -1.851296
H  -7.081815 0.935457 -2.497433
H  -7.868191 2.224638 -3.398687
H  -6.213886 1.781168 -3.787219
H  -7.236665 3.84121 -0.122421
H  -7.770937 2.174459 -0.384449
H  -8.459234 3.484681 -1.340108
H  -3.630578 1.823837 0.213723
H  0.603376 1.808566 2.266052
H  -0.248904 0.269947 2.401119
H  -1.690028 1.59969 -2.995436
H  1.791175 0.720747 -0.667033
H  0.709479 1.079902 -2.867174
H  3.803132 -0.410846 3.568096
H  4.688376 -1.643613 -0.446411
H  6.027581 0.617579 3.737135
H  6.908215 -0.601746 -0.27219
H  7.588722 0.53239 1.819944
H  -0.328436 -4.295449 0.153442
H  -0.256133 -3.114735 1.477134
H  0.145543 -2.619557 -0.178263
elementType: O N C H
totalener: -1385.00247684 hartree
nucrepener: 2742.00897985 hartree
electener: -4127.01145669 hartree
oneelecener: -7333.20250097 hartree
twoeener: 3206.19104428 hartree
cpcmener: -0.03969165 hartree
kineticenergy: 1379.22159506 hartree
xcener: -132.284240615001 hartree
chargesum: 0.0000000
charge: -0.337060 -0.212933 -0.500510 -0.156937 -0.408822 0.103884 -0.155674 -0.208178 -0.171552 -0.135055 0.272426 -0.313931 -0.313842 -0.279936 0.524453 0.299500 0.158009 0.291036 0.043477 0.055630 -0.229313 0.067557 -0.216759 -0.108929 -0.176523 -0.235722 -0.167146 -0.149192 -0.139324 -0.123277 0.103131 0.104362 0.103584 0.103166 0.103492 0.104450 0.101928 0.102529 0.093947 0.169914 0.119930 0.107376 0.159256 0.144197 0.158374 0.146537 0.150401 0.157287 0.158509 0.159125 0.125990 0.123461 0.123692
qa: -0.3371 -0.2129 -0.5005 -0.1569 -0.4088 0.1039 -0.1557 -0.2082 -0.1716 -0.1351 0.2724 -0.3139 -0.3138 -0.2799 0.5245 0.2995 0.1580 0.2910 0.0435 0.0556 -0.2293 0.0676 -0.2168 -0.1089 -0.1765 -0.2357 -0.1671 -0.1492 -0.1393 -0.1233 0.1031 0.1044 0.1036 0.1032 0.1035 0.1045 0.1019 0.1025 0.0939 0.1699 0.1199 0.1074 0.1593 0.1442 0.1584 0.1465 0.1504 0.1573 0.1585 0.1591 0.1260 0.1235 0.1237
va: 2.1135 2.0090 2.0042 3.1796 3.0346 3.3993 2.8774 2.9927 2.8105 2.8517 3.8028 3.9055 3.9050 3.9123 4.2721 4.0441 3.7847 3.7115 3.5295 3.8919 3.9079 4.2683 3.9107 3.9609 3.9532 3.9890 3.9137 3.9021 3.8994 3.8409 1.0031 1.0198 1.0066 1.0063 1.0031 1.0202 1.0077 1.0076 1.0064 1.0379 0.9943 1.0225 1.0260 1.0062 0.9943 1.0122 1.0058 0.9927 0.9917 0.9896 1.0073 0.9971 0.9929
dispcorr: -0.024885303 hartree
energy: -1385.027362139253
dipole: -34.70881 32.51663 -2.19218 22.60620 -19.91130 2.69489 -11.30535 11.52679 0.22144
magnitude: 3.48097 au
magnitude: 8.84792 debye
