program: Orca
programVersion: 5.0.2
elementType: O O O N N N N N N N C C C C C C C C C C C C C C C C C C C C H H H H H H H H H H H H H H H H H H H H H H H
charge: 0
multiplicity: 1
keywords: wb97x-d3
keywords: def2-TZVPP
keywords: def2/J RIJCOSX
keywords: DEFGRID2
keywords: scfconv7
keywords: smallprint printgap noloewdin
keywords: NOSOSCF
formula: C20H23N7O3
InChI: InChI=1/C20H23N7O3/c1-20(2,3)30-19(28)22-16-12-8-11-15(21-16)13-29-24-17(14-9-6-5-7-10-14)18-23-25-26-27(18)4/h5-12,22H,13H2,1-4H3
53 atoms
O  -5.292834 2.430889 -1.200239
O  1.795008 0.307894 1.814796
O  -3.854973 2.18729 -2.928871
N  -3.233605 1.844213 -0.75701
N  -1.302966 1.368864 0.316846
N  1.463043 -3.748023 0.832444
N  1.631986 -1.009903 1.580568
N  3.554861 -3.959534 1.247873
N  1.781707 -5.023412 0.686485
N  3.027688 -5.134439 0.934937
C  -6.448163 2.872141 -1.974069
C  -6.156402 4.194579 -2.669489
C  -6.8953 1.794391 -2.95171
C  -7.511423 3.072661 -0.903124
C  -4.117499 2.162102 -1.74798
C  -1.882964 1.545398 -0.862957
C  -0.006581 1.095906 0.378415
C  2.721484 -1.659795 1.455303
C  4.090061 -1.105204 1.550117
C  0.541753 0.964038 1.773601
C  -1.180991 1.429817 -2.064516
C  2.574848 -3.086527 1.186208
C  0.78684 0.980766 -0.752448
C  0.168915 1.145171 -1.98343
C  4.511383 -0.437817 2.697973
C  4.962398 -1.239266 0.472472
C  5.792236 0.089403 2.763224
C  6.238167 -0.700383 0.537708
C  6.655388 -0.036302 1.68313
C  0.105706 -3.301347 0.598516
H  -7.087188 4.600198 -3.068094
H  -5.462039 4.094847 -3.501354
H  -5.754489 4.927631 -1.967763
H  -7.022998 0.834109 -2.449178
H  -7.86298 2.074297 -3.369838
H  -6.206879 1.661563 -3.783667
H  -7.207611 3.824975 -0.173105
H  -7.724224 2.143849 -0.370828
H  -8.439529 3.411533 -1.362993
H  -3.572464 1.876359 0.195385
H  0.724678 1.954611 2.196011
H  -0.183947 0.458504 2.416479
H  -1.657419 1.555936 -3.021944
H  1.846439 0.776751 -0.69098
H  0.74599 1.054288 -2.894639
H  3.849674 -0.340906 3.548962
H  4.644923 -1.757789 -0.423563
H  6.115383 0.601325 3.660478
H  6.907003 -0.803139 -0.306813
H  7.653204 0.379966 1.73532
H  -0.348017 -2.955024 1.522849
H  0.094813 -2.49759 -0.13281
H  -0.453545 -4.148128 0.212785
elementType: O N C H
totalener: -1385.00237912 hartree
nucrepener: 2745.84663084 hartree
electener: -4130.84900996 hartree
oneelecener: -7340.87351031 hartree
twoeener: 3210.02450035 hartree
cpcmener: -0.03966468 hartree
kineticenergy: 1379.21893721 hartree
xcener: -132.283463861095 hartree
chargesum: 0.0000000
charge: -0.336963 -0.212942 -0.500428 -0.156629 -0.405620 0.103937 -0.155363 -0.208032 -0.171500 -0.134747 0.271704 -0.314029 -0.313818 -0.279356 0.523887 0.300683 0.153994 0.289271 0.041972 0.058324 -0.228880 0.069522 -0.219490 -0.108606 -0.176768 -0.236652 -0.166159 -0.148708 -0.140212 -0.123966 0.103388 0.104095 0.103856 0.103348 0.103676 0.104224 0.102086 0.102483 0.093805 0.169829 0.119678 0.106894 0.159016 0.144174 0.158504 0.146608 0.150968 0.157353 0.158531 0.159246 0.123432 0.123969 0.126414
qa: -0.3370 -0.2129 -0.5004 -0.1566 -0.4056 0.1039 -0.1554 -0.2080 -0.1715 -0.1347 0.2717 -0.3140 -0.3138 -0.2794 0.5239 0.3007 0.1540 0.2893 0.0420 0.0583 -0.2289 0.0695 -0.2195 -0.1086 -0.1768 -0.2367 -0.1662 -0.1487 -0.1402 -0.1240 0.1034 0.1041 0.1039 0.1033 0.1037 0.1042 0.1021 0.1025 0.0938 0.1698 0.1197 0.1069 0.1590 0.1442 0.1585 0.1466 0.1510 0.1574 0.1585 0.1592 0.1234 0.1240 0.1264
va: 2.1130 2.0083 2.0049 3.1785 3.0337 3.3988 2.8799 2.9928 2.8107 2.8520 3.8035 3.9056 3.9056 3.9123 4.2732 4.0412 3.7922 3.7144 3.5302 3.8839 3.9094 4.2653 3.9120 3.9595 3.9531 3.9899 3.9131 3.9021 3.9006 3.8406 1.0031 1.0195 1.0066 1.0064 1.0032 1.0198 1.0075 1.0075 1.0066 1.0381 0.9938 1.0235 1.0260 1.0067 0.9942 1.0125 1.0055 0.9927 0.9917 0.9896 0.9971 0.9925 1.0072
dispcorr: -0.024968940 hartree
energy: -1385.027348062189
dipole: -34.33192 32.25444 -2.07748 22.20476 -19.43372 2.77104 -11.76432 11.89433 0.13001
magnitude: 3.46576 au
magnitude: 8.80927 debye
