program: Orca
programVersion: 5.0.2
elementType: O O O N N N N N N N C C C C C C C C C C C C C C C C C C C C H H H H H H H H H H H H H H H H H H H H H H H
charge: 0
multiplicity: 1
keywords: wb97x-d3
keywords: def2-TZVPP
keywords: def2/J RIJCOSX
keywords: DEFGRID2
keywords: scfconv7
keywords: smallprint printgap noloewdin
keywords: NOSOSCF
formula: C20H23N7O3
InChI: InChI=1/C20H23N7O3/c1-20(2,3)30-19(28)22-16-12-8-11-15(21-16)13-29-24-17(14-9-6-5-7-10-14)18-23-25-26-27(18)4/h5-12,22H,13H2,1-4H3
53 atoms
O  -5.278928 2.420578 -1.209973
O  1.814063 0.339991 1.810558
O  -3.849657 2.15183 -2.94182
N  -3.214898 1.852792 -0.767002
N  -1.280485 1.396966 0.307617
N  1.421714 -3.719157 0.867983
N  1.6315 -0.978181 1.591735
N  3.507872 -3.96053 1.295608
N  1.719446 -5.001259 0.738716
N  2.962212 -5.130072 0.994659
C  -6.439851 2.844615 -1.984936
C  -6.15343 4.150197 -2.713685
C  -6.893194 1.744179 -2.933924
C  -7.494482 3.070197 -0.910704
C  -4.104952 2.148962 -1.759153
C  -1.864382 1.553866 -0.873192
C  0.016366 1.126738 0.369148
C  2.711403 -1.644354 1.469893
C  4.088123 -1.108647 1.550846
C  0.570188 1.013205 1.763634
C  -1.166059 1.420995 -2.074961
C  2.542695 -3.072281 1.218961
C  0.806645 0.996395 -0.762364
C  0.184883 1.140824 -1.99383
C  4.523546 -0.424572 2.683345
C  4.955833 -1.28039 0.474838
C  5.813409 0.081747 2.73487
C  6.241044 -0.763131 0.526378
C  6.671988 -0.082153 1.656404
C  0.07438 -3.251347 0.618932
H  -7.08959 4.553626 -3.102414
H  -5.476872 4.02761 -3.557051
H  -5.732754 4.895455 -2.03574
H  -7.006051 0.793436 -2.409739
H  -7.869075 2.008442 -3.343837
H  -6.215255 1.599914 -3.772768
H  -7.184536 3.839186 -0.201051
H  -7.703096 2.154077 -0.355569
H  -8.425921 3.398708 -1.371157
H  -3.550107 1.89918 0.186156
H  0.769908 2.00837 2.166908
H  -0.158984 0.529696 2.419095
H  -1.645979 1.531536 -3.03257
H  1.866575 0.794531 -0.700241
H  0.759216 1.036862 -2.905313
H  3.865931 -0.299512 3.533571
H  4.62765 -1.812188 -0.409051
H  6.148003 0.605906 3.620505
H  6.906423 -0.894979 -0.316779
H  7.677043 0.317547 1.697982
H  -0.496689 -4.091725 0.236383
H  -0.380554 -2.887586 1.535679
H  0.084182 -2.455177 -0.120514
elementType: O N C H
totalener: -1385.00232881 hartree
nucrepener: 2747.53483520 hartree
electener: -4132.53716401 hartree
oneelecener: -7344.24150605 hartree
twoeener: 3211.70434205 hartree
cpcmener: -0.03963666 hartree
kineticenergy: 1379.22503744 hartree
xcener: -132.284484866486 hartree
chargesum: -0.0000000
charge: -0.336980 -0.213099 -0.500246 -0.156456 -0.404606 0.104266 -0.155540 -0.207835 -0.171626 -0.134507 0.271549 -0.314430 -0.313489 -0.278851 0.523436 0.301070 0.152488 0.289682 0.040525 0.059446 -0.228712 0.069549 -0.220260 -0.108293 -0.176179 -0.236795 -0.166325 -0.148591 -0.140248 -0.123937 0.103415 0.103934 0.104272 0.103344 0.103737 0.103778 0.102261 0.102400 0.093668 0.169841 0.119319 0.106625 0.158920 0.144057 0.158622 0.146595 0.151204 0.157341 0.158609 0.159242 0.126622 0.123148 0.124040
qa: -0.3370 -0.2131 -0.5002 -0.1565 -0.4046 0.1043 -0.1555 -0.2078 -0.1716 -0.1345 0.2715 -0.3144 -0.3135 -0.2789 0.5234 0.3011 0.1525 0.2897 0.0405 0.0594 -0.2287 0.0695 -0.2203 -0.1083 -0.1762 -0.2368 -0.1663 -0.1486 -0.1402 -0.1239 0.1034 0.1039 0.1043 0.1033 0.1037 0.1038 0.1023 0.1024 0.0937 0.1698 0.1193 0.1066 0.1589 0.1441 0.1586 0.1466 0.1512 0.1573 0.1586 0.1592 0.1266 0.1231 0.1240
va: 2.1125 2.0080 2.0055 3.1778 3.0332 3.3987 2.8803 2.9931 2.8107 2.8519 3.8033 3.9055 3.9064 3.9125 4.2740 4.0399 3.7946 3.7145 3.5304 3.8815 3.9098 4.2642 3.9121 3.9590 3.9529 3.9906 3.9134 3.9025 3.9010 3.8405 1.0031 1.0194 1.0065 1.0066 1.0032 1.0195 1.0074 1.0074 1.0067 1.0381 0.9937 1.0239 1.0260 1.0069 0.9941 1.0127 1.0053 0.9928 0.9918 0.9896 1.0072 0.9973 0.9925
dispcorr: -0.025006722 hartree
energy: -1385.027335527021
dipole: -34.16908 32.14354 -2.02554 22.04363 -19.24229 2.80133 -11.98349 12.06608 0.08259
magnitude: 3.45791 au
magnitude: 8.78930 debye
