program: Orca
programVersion: 5.0.2
elementType: O O O N N N N N N N C C C C C C C C C C C C C C C C C C C C H H H H H H H H H H H H H H H H H H H H H H H
charge: 0
multiplicity: 1
keywords: wb97x-d3
keywords: def2-TZVPP
keywords: def2/J RIJCOSX
keywords: DEFGRID2
keywords: scfconv7
keywords: smallprint printgap noloewdin
keywords: NOSOSCF
formula: C20H23N7O3
InChI: InChI=1/C20H23N7O3/c1-20(2,3)30-19(28)22-16-12-8-11-15(21-16)13-29-24-17(14-9-6-5-7-10-14)18-23-25-26-27(18)4/h5-12,22H,13H2,1-4H3
53 atoms
O  -4.676159 0.07666 0.196938
O  1.941971 -1.583428 1.225035
O  -4.19775 -0.631746 -1.900122
N  -2.803913 -1.007035 -0.128007
N  -0.76668 -1.940964 0.154401
N  1.604496 1.164035 2.279547
N  2.616322 -0.986227 0.214861
N  3.694848 1.100151 2.736739
N  1.770404 1.69759 3.481528
N  3.015656 1.652927 3.740656
C  -5.963338 0.676338 -0.109722
C  -6.946197 -0.373305 -0.61499
C  -6.422123 1.209857 1.241539
C  -5.806143 1.826629 -1.096693
C  -3.936815 -0.524182 -0.729714
C  -1.74181 -1.68796 -0.704613
C  0.316686 -2.587638 -0.258617
C  3.054978 0.172338 0.511561
C  3.790525 0.920904 -0.523595
C  1.389155 -2.80638 0.772919
C  -1.688427 -2.085739 -2.044286
C  2.806846 0.790087 1.826843
C  0.471627 -3.01976 -1.56348
C  -0.558285 -2.760589 -2.457718
C  3.652026 0.565096 -1.867626
C  4.623098 1.986722 -0.188729
C  4.331546 1.261056 -2.84953
C  5.304699 2.678849 -1.178912
C  5.161483 2.321861 -2.509342
C  0.300439 1.052693 1.672518
H  -6.680353 -0.754016 -1.598114
H  -7.93906 0.071845 -0.687345
H  -7.013756 -1.212689 0.078397
H  -7.394878 1.690155 1.13978
H  -6.519911 0.408001 1.974067
H  -5.724453 1.949776 1.635387
H  -6.754945 2.357354 -1.182857
H  -5.523012 1.487488 -2.090135
H  -5.061857 2.543525 -0.747154
H  -2.697989 -0.853861 0.863089
H  0.968121 -3.268005 1.666418
H  2.175976 -3.457347 0.38234
H  -2.494664 -1.87422 -2.726066
H  1.371915 -3.532054 -1.872501
H  -0.479725 -3.081884 -3.48797
H  2.999687 -0.254275 -2.136987
H  4.762937 2.265572 0.846744
H  4.208968 0.97882 -3.886837
H  5.952511 3.499988 -0.902828
H  5.691194 2.866856 -3.279568
H  -0.082177 0.039028 1.761547
H  -0.362551 1.749661 2.175276
H  0.360642 1.312934 0.618149
totalener: -1384.97193425 hartree
nucrepener: 2841.75631015 hartree
electener: -4226.72824440 hartree
oneelecener: -7532.10687548 hartree
twoeener: 3305.37863108 hartree
kineticenergy: 1379.29677355 hartree
xcener: -132.289782282494 hartree
chargesum: 0.0000000
charge: -0.325305 -0.191627 -0.427278 -0.173399 -0.393073 0.083259 -0.100150 -0.200623 -0.147275 -0.082615 0.239411 -0.304579 -0.250482 -0.300927 0.493730 0.298379 0.109256 0.135802 -0.003465 0.030137 -0.194250 0.134541 -0.147415 -0.089920 -0.168692 -0.170460 -0.116673 -0.120456 -0.117061 -0.159049 0.118271 0.089255 0.095082 0.080841 0.097006 0.096005 0.089426 0.118029 0.092871 0.155132 0.104409 0.096390 0.154715 0.118519 0.132079 0.124121 0.154051 0.124685 0.129100 0.127709 0.113252 0.128600 0.120715
qa: -0.3253 -0.1916 -0.4273 -0.1734 -0.3931 0.0833 -0.1002 -0.2006 -0.1473 -0.0826 0.2394 -0.3046 -0.2505 -0.3009 0.4937 0.2984 0.1093 0.1358 -0.0035 0.0301 -0.1943 0.1345 -0.1474 -0.0899 -0.1687 -0.1705 -0.1167 -0.1205 -0.1171 -0.1590 0.1183 0.0893 0.0951 0.0808 0.0970 0.0960 0.0894 0.1180 0.0929 0.1551 0.1044 0.0964 0.1547 0.1185 0.1321 0.1241 0.1541 0.1247 0.1291 0.1277 0.1133 0.1286 0.1207
va: 2.1076 1.9995 2.0723 3.1783 3.0128 3.3359 2.9047 2.9015 2.7983 2.8597 3.8753 3.9076 3.9102 3.9073 4.2735 4.0258 3.8662 3.8987 3.7558 3.9467 3.9655 4.0835 3.9114 3.9757 4.0269 3.9729 3.9544 3.9637 3.9611 3.8417 1.0189 1.0061 1.0088 1.0101 1.0108 1.0109 1.0063 1.0189 1.0093 1.0479 1.0062 1.0064 1.0289 1.0053 1.0013 1.0209 1.0295 1.0023 1.0030 0.9994 1.0210 1.0075 0.9914
dispcorr: -0.026309320 hartree
energy: -1384.998243567844
dipole: -34.37579 32.51192 -1.86387 5.15049 -5.66692 -0.51643 -10.86702 9.10540 -1.76162
magnitude: 2.61611 au
magnitude: 6.64962 debye
